{"text_format":"3","workbook":"xlsx","n_sheets":23,"sheets":["Màj ","Menu","0","1","2","3","5","6","6bis","7","7bis","8","9","10","11","12","13","14","15","16","17","18","19"],"not_rendered":{"images":3,"macros":1,"defined_names":1,"comments":16},"read":"whole","date_system":"1900"}

{"sheet":"Màj ","index":0,"n_rows":17,"n_cols":4,"rows_kept":17}
[]
[]
[]
["Ce calculateur a été conçu pour fonctionner sous Excel 2007.  Avec Open Office, certaines protections, commentaires et alarmes n'apparaissent pas, des tableaux"]
["sont décalés et il est très facile de supprimer ou modifier une formule d'un simple clic sans s'en apercevoir !"]
["Donc méfiance, je recommande vivement  l'acquisition d'Excel 2007 . "]
[]
[null,null,"Mise à jour du 14 septembre 2012"]
[]
[null,"     Ajout de la page 19 :",null,"Trajet scooter retour à la palme"]
[]
[]
[]
[null,"Tous les calculs de ce calculateur sont basés sur les gaz parfaits."]
[null,"Je travaille actuellement sur les modifications à faire pour les gaz réels, mais les calculs étant complexes (température, nature des gaz, mélanges des gaz, pourcentages etc...!)  ce sera pour une prochaine mise à jour."]
[null,"Les logiciels actuellement sur le marché donnent des résultats très différents et il n'est pas évident de comparer…"]
[null,"Obtenir un résultat n'est pas difficile, mais de là à ce qu'il soit juste, c'est une autre histoire !"]

{"sheet":"Menu","index":1,"n_rows":29,"n_cols":6,"rows_kept":29,"merged":[[1,1,2,4],[3,1,4,1],[4,2,4,3],[5,1,5,4],[6,1,6,4],[7,1,7,4],[8,1,8,4],[11,2,13,2],[17,3,18,3],[22,1,23,1],[24,1,25,1],[27,0,27,6],[28,1,28,4]]}
[]
[]
[]
[null,"(fm 12 .4)  Excel 2007"]
[null,null,"AVERTISSEMENT",null,null,"  "]
[null,"Tableur Excel uniquement pédagogique, pour plongées réelles consulter des logiciels reconnus"]
[null,"Ce tableur ne dispense en aucun cas d'une formation aux recycleurs, aux mélanges ainsi qu'à leur fabrication "]
[null,"A chaque mise à jour : détruire l'ancienne version "]
[null,"Si vous détectez un\"bug\", prévenez moi sur le forum du site plongéesout  ou par mail "]
[null,"Cliquer sur Affichage, Zoom, 100 ou 80% (pour centrer les pages si besoin)"]
[null,"Cliquer sur Affichage, Plein écran (pour plus de clarté)",null,"CALCULS","RECYCLEUR"]
[null,null,"TRIMIX  /  NITROX"]
[]
[]
[]
[null,"Jean-Pierre COULOUMY"]
{"$rows_empty":11}
["Pour des commodités de lecture, certains chiffres sont arrondis au chiffre > ou < , c'est pourquoi il peut y avoir une légère différence d'un tableau à l' autre !"]
[null,"Pour que les pages ne sautent pas lorsqu'on fait \"entrée\", ne pas faire \"entrée\" sur le clavier mais, cliquer sur la page !"]

{"sheet":"0","index":2,"n_rows":31,"n_cols":9,"rows_kept":31,"merged":[[4,0,4,1],[5,2,7,8],[10,3,12,7],[16,3,17,3],[16,4,17,4],[16,5,17,5],[16,6,17,6],[16,7,17,7],[16,8,17,8],[19,4,20,6],[23,3,24,3],[23,4,24,4],[24,6,25,6],[24,7,25,7],[24,8,25,8],[26,3,27,3],[26,4,27,4],[30,4,31,6]]}
[]
[]
[]
[]
["JP Couloumy"]
[null,null,"Quel mélange choisir"]
[]
[]
[]
[]
[{"$nulls":3},"PARAMETRES  DE  LA  PLONGEE"]
[]
[]
[]
[{"$nulls":3},"Profondeur",null,"PP 02 maxi",null,"PP N2 maxi"]
[]
[{"$nulls":3},150,"m",{"v":1.3,"d":"1.30"},"b",3.15,"b"]
[]
[]
[{"$nulls":4},"MELANGE A REALISER"]
[]
[]
[]
[null,null,{"$f":"IF(F17/(D17/10+1)>1,1,F17/(D17/10+1))","v":0.08125},"O2",{"$f":"ROUNDDOWN(C24,2)","v":{"v":0.08,"d":"8%"}}]
[null,null,{"$f":"1-C24-C26","v":{"v":0.7218749999999999,"d":"0.72188"}},{"$nulls":3},"Pne =",{"$f":"(H17/0.79-1)*10","v":{"v":29.873417721518983,"d":"30"}},"m"]
[null,null,{"$f":"IF(H17/(D17/10+1)+C24>1,1-C24,H17/(D17/10+1))","v":{"v":0.196875,"d":"0.19688"}},"Hé",{"$f":"ROUNDUP(C25,2)","v":{"v":0.73,"d":"73%"}}]
[{"$nulls":3},"N2",{"$f":"1-E26-E24","v":{"v":0.19,"d":"19%"}}]
[]
[null,null,{"$f":"SUM(C24:C26)","v":{"v":1,"d":"1.00000"}},null,{"$f":"SUM(E24:E27)","v":{"v":1,"d":"100%"}}]
[]
[{"$nulls":4},{"$f":"IF(E26>0,\"Trimix    \"&TEXT(E24*100,0)&\"  /  \"&TEXT(E26*100,0),\"Nitrox    \"&TEXT(E24*100,0))","v":"Trimix    8  /  73"}]

{"sheet":"1","index":3,"n_rows":350,"n_cols":26,"rows_kept":350,"merged":[[7,4,8,10],[11,2,12,7],[12,9,12,11],[13,3,13,5],[13,9,14,9],[13,10,14,10],[13,11,14,11],[14,3,14,6],[15,3,16,3],[15,4,16,4],[15,5,16,5],[16,6,17,6],[16,8,17,8],[17,3,18,3],[17,4,18,4],[17,5,18,5],[18,7,19,7],[19,4,19,5],[20,8,21,11],[22,8,23,9],[22,10,23,10],[22,11,23,11],[26,2,26,7],[28,4,28,6],[32,1,32,3],[33,8,33,9],[34,8,34,9],[35,8,35,9],[36,8,36,9],[37,1,38,9],[39,3,41,6],[40,7,41,9],[44,7,44,9],[46,7,46,9],[46,10,46,12],[47,1,48,2],[47,3,48,3],[47,4,48,4],[47,5,48,5],[47,6,48,7],[47,9,48,10],[47,11,48,11],[47,12,48,12],[47,13,48,14],[47,15,48,16]]}
[null,"Attention :  "]
[null,"L'alarme narcose est réglée pour une PNe de 60m : pour plus de sécurité et pour limiter l'essouflement et la déco, s'en tenir à 30, 35m."]
[null,"Alarme Hypoxie < 0,19          Alarme Hyperoxie (de 0 à 43 m) >1,6 et (de 44 à 300 m) >1,43           Alarme Narcose >5,53"]
[null,"Les phénomènes de compressibilité des gaz ne sont pas pris en charge dans ce tableur, en tenir compte pour les pressions élevées !"]
[]
[]
[]
[]
[]
["   JP Couloumy"]
[{"$nulls":3},"HELIUM",null,"  OXYGENE",null,null,"NITROX",null,null,"      AIR"]
[null,null,{"$f":"IF(K18<0,\"impossible à réaliser par PP\",IF(K19<0,\"impossible à réaliser par PP\",IF(K20<0,\"impossible à réaliser par PP\",\"\")))","v":""}]
[{"$nulls":9},"Fabrication  Héliair"]
[{"$nulls":3},"Mélange désiré",{"$nulls":5},"Hé",{"$f":"(F16/100)*H17","v":0},"B"]
[{"$nulls":3},{"$f":"IF(D16=\"Air\",\"\",IF(E16<21,IF(E16>17.9,\"Héliair < 15%  ?\",\"\")))","v":""},{"$nulls":3},"Pression"]
[{"$nulls":3},{"$f":"IF(F16=0,\"Air\",\"Héliair\")","v":"Air"},{"$f":"N31","v":{"v":21,"d":"21.0"}},0,null,"désirée",null,"Air",{"$f":"(H17-K14)","v":200},"B",{"$nulls":5},"restante","désirée","rajout"]
[{"$nulls":7},200,null,"Fabrication trimix ( PP )",null,null,{"$f":"K14+K16","v":200},{"$nulls":3},"Pression",0,{"$f":"H17","v":200},{"$f":"S17-R17","v":{"v":200,"d":"200.00"}}]
[{"$nulls":3},{"$f":"IF(E18+F18=100,\"Héliox\",IF(F18=0,\"Nitrox\",IF(F18>0,\"Trimix\")))","v":"Trimix"},10.5,50,null,"Bars",null,"O2",{"$f":"F22","v":{"v":0,"d":"0.0"}},"B",{"$nulls":4},"% o2",{"v":0,"d":"0%"},{"$f":"E18/100","v":{"v":0.105,"d":"11%"}}]
[{"$nulls":7},{"$f":"IF(K18<0,\"?\",\"\")","v":""},null,"Hé",{"$f":"G20","v":{"v":100,"d":"100.0"}},"B",{"$nulls":4},"% Hé",{"v":0,"d":"0%"},{"$f":"(F18/100)","v":{"v":0.5,"d":"50%"}}]
[null,null,"Hé =",{"$f":"F18","v":{"v":50,"d":"50.0"}},{"$f":"IF(E18+F18>100,\"> à 100 %   !\",\"\")","v":""},null,{"$f":"F18/100*(H17)","v":{"v":100,"d":"100.0"}},null,null,"Air",{"$f":"F23","v":{"v":100,"d":"100.0"}},"B",{"$nulls":4},"% N2",{"$f":"IF(R18=0,0,IF(R19=0,1-R18,1-R18-R19))","v":{"v":0,"d":"0%"}},{"$f":"IF(S18=0,0,IF(S19=0,1-S18,IF(S19>0,1-S18-S19)))","v":{"v":0.395,"d":"40%"}}]
[null,null,"N2=",{"$f":"(100-F18)-E18","v":39.5},"%",{"$f":"D21/100*(H17)","v":{"v":79,"d":"79.0"}},"bars",null,"Fabrication trimix (stick, tamp)",{"$nulls":7},"PP o2",{"$f":"R17*R18","v":{"v":0,"d":"0.00"}},{"$f":"S17*S18","v":{"v":21,"d":"21.00"}},{"$f":"S21-R21","v":{"v":21,"d":"21.00"}}]
[null,null,"O2=",{"$f":"100-(D20+D21)","v":10.5},"%",{"$f":"H25/100*(H17)","v":{"v":0,"d":"0.0"}},"bars",{"$nulls":9},"PP Hé",{"$f":"R17*R19","v":{"v":0,"d":"0.00"}},{"$f":"S17*S19","v":{"v":100,"d":"100.00"}},{"$f":"S22-R22","v":{"v":100,"d":"100.00"}}]
[null,null,"Air=",{"$f":"100/79*D21","v":{"v":50,"d":"50.0"}},"%",{"$f":"D23/100*(H17)","v":{"v":100,"d":"100.0"}},"bars",null,"Hé",null,{"$f":"(F18/100)*H17","v":{"v":100,"d":"100.0"}},"B",{"$nulls":4},"PP N2",{"$f":"R17*R20","v":{"v":0,"d":"0.00"}},{"$f":"S17*S20","v":{"v":79,"d":"79.00"}},{"$f":"S23-R23","v":{"v":79,"d":"79.00"}}]
[null,null,"O2 air",{"$f":"21/79*D21","v":{"v":10.499999999999998,"d":"10.5"}},"%","stick nitrox"]
[{"$nulls":3},{"$f":"D20+D21+D22","v":{"v":100,"d":"100.0"}},"%",{"$f":"G20+F22+F23","v":200},"bars",{"$f":"D22-D24","v":{"v":0,"d":"0.0"}},"N",30,{"$f":"R27","v":{"v":0,"d":"0.0"}},"B",{"$nulls":4},"O2",{"$f":"J25/100","v":{"v":0.3,"d":"30%"}},null,"O2",{"v":0.21,"d":"21%"}]
[{"$nulls":8},"Air",null,{"$f":"U31","v":{"v":100,"d":"100.0"}},"B",{"$nulls":4}," N2",{"$f":"1-R25","v":{"v":0.7,"d":"70%"}},"tampon "," N2",{"$f":"1-U25","v":{"v":0.79,"d":"79%"}},"compresseur"]
[null,null,{"$f":"IF(K23<0,\"impossible à réaliser avec ce nitrox\",IF(K25<0,\"impossible à réaliser avec ce nitrox\",IF(K26<0,\"impossible à réaliser avec ce nitrox\",\"\")))","v":""},{"$nulls":13},{"$f":"\"Nitrox \"&TEXT(R25*100,0)","v":"Nitrox 30"},{"$f":"(U26*T21-U25*T23)/(R25*U26-R26*U25)","v":{"v":0,"d":"0.00"}},"bars","O2",{"$f":"R27*R25+U31*U25+R17*R18","v":{"v":21,"d":"21.00"}},"bars",{"$f":"U27/X32","v":{"v":1,"d":"100%"}}]
[]
[{"$nulls":4},"PRIX remplissage ",null,null,"           Prix pratiqués à la station de gonflage "]
[{"$nulls":4}," Hé",{"v":0.0255,"d":"0.0255 €"},"le litre","           L'AIR DES VASQUES DU QUERCY",{"$nulls":7},{"$f":"K18+K19+K20","v":200},{"$nulls":3},"Hélium",{"$f":"T22","v":{"v":100,"d":"100.00"}},"bars","He",{"$f":"U30+R17*R19","v":{"v":100,"d":"100.00"}},"bars",{"$f":"X30/X32","v":{"v":4.761904761904762,"d":"476%"}}]
[{"$nulls":4},"O2",{"v":0.021,"d":"0.0210 €"},"le litre","                   à Gramat dans le LOT",{"$nulls":4}," =         Hr",{"$f":"(K16)*(21/100)/(H17)*100","v":{"v":21,"d":"21.0"}},null,{"$f":"K14/H17*100","v":0},{"$nulls":3},"compresseur",{"$f":"(R25*T23-R26*T21)/(R25*U26-R26*U25)","v":{"v":100,"d":"100.00"}},"bars","N2",{"$f":"R27*R26+U31*U26+R17*R20","v":{"v":79,"d":"79.00"}},"bars",{"$f":"X31/X32","v":{"v":3.761904761904762,"d":"376%"}}]
[{"$nulls":4},"AIR",{"v":2E-3,"d":"0.0020 €"},"le litre","                              Chez André GRIMAL ",{"$nulls":5},{"$f":"IF(K20<0,\"Héliox impossible !\",\"\")","v":""},{"$nulls":8},"Total",{"$f":"SUM(U27:U29)","v":{"v":21,"d":"21.00"}},"bars",{"$f":"SUM(W27:W29)","v":{"v":1,"d":"100%"}}]
[null,"   Quantité de bouteilles",{"$nulls":10},"      N2   =",{"$f":"100-(N31+P31)","v":{"v":79,"d":"79.0"}},{"$nulls":10},{"$f":"IF(W27=1,\"Oxygene\",IF(Z30>0,\"Trimix \"&TEXT(W27*100,0)&\"/\"&TEXT(Z30*100,0),\"Nitrox \"&TEXT(W27*100,0)))","v":"Oxygene"}]
[null,1,{"$f":"IF(B34=0,\"\",\"X\")","v":"X"},{"v":18,"d":"18 L"},{"$f":"H$17","v":{"v":200,"d":"200 bars"}},{"$f":"IF(D$18=\"Nitrox\",\" Nitrox\",IF(D$18=\"Trimix\",\"Trimix\",IF(D$18=\"AIR\",\"AIR\",\"Héliox\")))","v":"Trimix"},{"$f":"IF(D$18=\"AIR\",\"\",E$18)","v":10.5},{"$f":"IF(D$18=\"AIR\",\"\",IF(F$18=0,\"\",F$18))","v":50},{"$f":"(F30*D34*B34*K19)+(F31*D34*B34*K18)+(F32*D34*B34*K20)","v":{"v":49.5,"d":"49.50 €"}},{"$nulls":3},"Total",{"$f":"K14+K16","v":200},null,"bars"]
[null,1,{"$f":"IF(B35=0,\"\",\"X\")","v":"X"},{"v":10,"d":"10 L"},{"$f":"H$17","v":{"v":200,"d":"200 bars"}},{"$f":"IF(D$18=\"Nitrox\",\" Nitrox\",IF(D$18=\"Trimix\",\"Trimix\",IF(D$18=\"AIR\",\"AIR\",\"Héliox\")))","v":"Trimix"},{"$f":"IF(D$18=\"AIR\",\"\",E$18)","v":10.5},{"$f":"IF(D$18=\"AIR\",\"\",IF(F$18=0,\"\",F$18))","v":50},{"$f":"(F30*D35*B35*K19)+(F31*D35*B35*K18)+(F32*D35*B35*K20)","v":{"v":27.5,"d":"27.50 €"}}]
[null,1,{"$f":"IF(B36=0,\"\",\"X\")","v":"X"},{"v":12,"d":"12 L"},{"$f":"H$17","v":{"v":200,"d":"200 bars"}},{"$f":"IF(D$18=\"Nitrox\",\" Nitrox\",IF(D$18=\"Trimix\",\"Trimix\",IF(D$18=\"AIR\",\"AIR\",\"Héliox\")))","v":"Trimix"},{"$f":"IF(D$18=\"AIR\",\"\",E$18)","v":10.5},{"$f":"IF(D$18=\"AIR\",\"\",IF(F$18=0,\"\",F$18))","v":50},{"$f":"(F30*D36*B36*K19)+(F31*D36*B36*K18)+(F32*D36*B36*K20)","v":{"v":33,"d":"33.00 €"}}]
[null,null,{"$f":"IF(B37=0,\"\",\"X\")","v":""},null,{"$f":"H$17","v":{"v":200,"d":"200 bars"}},{"$f":"IF(D$18=\"Nitrox\",\" Nitrox\",IF(D$18=\"Trimix\",\"Trimix\",IF(D$18=\"AIR\",\"AIR\",\"Héliox\")))","v":"Trimix"},{"$f":"IF(D$18=\"AIR\",\"\",E$18)","v":10.5},{"$f":"IF(D$18=\"AIR\",\"\",IF(F$18=0,\"\",F$18))","v":50},{"$f":"(F30*D37*B37*K19)+(F31*D37*B37*K18)+(F32*D37*B37*K20)","v":{"v":0,"d":"0.00 €"}}]
[null,"Prix total des bouteilles  (mélange identique)"]
[]
[{"$nulls":3},{"$f":"I34+I35+I36+I37","v":{"v":110,"d":"110.00 €"}}]
[{"$nulls":7},{"$f":"D40*6.55957","v":{"v":721.5527,"d":"(722F)"}}]
[]
[null,"(aligner en haut de la page)"]
[]
[]
[]
[{"$nulls":3},{"$f":"D16","v":"Air"},null,{"$f":"E16","v":{"v":21,"d":"21.0"}},{"$f":"F16","v":0},{"$nulls":3},{"$f":"D18","v":"Trimix"},null,null,{"$f":"E18","v":10.5},null,{"$f":"F18","v":50}]
[null,"    prof.",null,"pp O2","pp N2","Pne","DANGER",null,null,"  prof.",null,"pp O2","pp N2","Pne    Ppge",null," DANGER"]
[]
["clic",0,"m",{"$f":"((B50/10)+1)*$N$31/100","v":0.21},{"$f":"((B50/10)+1)*$N$33/100","v":0.79},{"$f":"IF(E50<0.79,0,(10*E50)/0.79-7.9/0.79)","v":{"v":0,"d":"0 m"}},{"$f":"IF(D50>1.47,\"Hyperoxie\",IF(D50<0.19,\"Hypoxie\",\"\"))","v":""},{"$f":"IF(E50>5.53,\"Narcose\",IF(E50>3.56,\"pne>35m\",\"\"))","v":""},null,0,"m",{"$f":"((J50/10)+1)*$D$22/100","v":{"v":0.105,"d":"0.11"}},{"$f":"((J50/10)+1)*$D$21/100","v":{"v":0.395,"d":"0.40"}},{"$f":"IF(M50<0.79,0,(10*M50)/0.79-7.9/0.79)","v":{"v":0,"d":"0 m"}},"lire",{"$f":"IF(L50>1.6,\"Hyperoxie\",IF(L50<0.19,\"Hypoxie\",\"\"))","v":"Hypoxie"},{"$f":"IF(M50>5.53,\"Narcose\",IF(M50>3.56,\"pne > 35m\",\"\"))","v":""}]
[{"$f":"(B51/10)+1","v":1.1},1,"m",{"v":0.231,"d":"0.23"},{"v":0.8690000000000001,"d":"0.87"},{"$f":"IF(E51<0.79,0,(10*E51)/0.79-7.9/0.79)","v":{"v":1.0000000000000018,"d":"1 m"}},{"$f":"IF(D51>1.47,\"Hyperoxie\",IF(D51<0.19,\"Hypoxie\",\"\"))","v":""},{"$f":"IF(E51>5.53,\"Narcose\",IF(E51>3.56,\"pne>35m\",\"\"))","v":""},null,1,"m",{"$f":"((J51/10)+1)*$D$22/100","v":{"v":0.1155,"d":"0.12"}},{"$f":"((J51/10)+1)*$D$21/100","v":{"v":0.43450000000000005,"d":"0.43"}},{"$f":"IF(M51<0.79,0,(10*M51)/0.79-7.9/0.79)","v":{"v":0,"d":"0 m"}},{"$f":"IF(O52<=0,0,(((((($E$18%*1.428)+($F$18%*0.178)+($D$21%*1.25))*A51))/1.28738)*10)-10)","v":{"v":0,"d":"0 m"}},{"$f":"IF(L51>1.6,\"Hyperoxie\",IF(L51<0.19,\"Hypoxie\",\"\"))","v":"Hypoxie"},{"$f":"IF(M51>5.53,\"Narcose\",IF(M51>3.56,\"pne > 35m\",\"\"))","v":""}]
[{"$f":"(B52/10)+1","v":1.2},2,"m",{"v":0.252,"d":"0.25"},{"v":0.948,"d":"0.95"},{"v":2,"d":"2 m"},"","",null,2,"m",{"v":0.126,"d":"0.13"},{"v":0.474,"d":"0.47"},{"v":0,"d":"0 m"},{"$f":"IF(O53<=0,0,(((((($E$18%*1.428)+($F$18%*0.178)+($D$21%*1.25))*A52))/1.28738)*10)-10)","v":{"v":0,"d":"0 m"}},"Hypoxie",""]
[1.3,3,"m",{"v":0.273,"d":"0.27"},{"v":1.0270000000000001,"d":"1.03"},{"v":3.0000000000000018,"d":"3 m"},"","",null,3,"m",{"v":0.1365,"d":"0.14"},{"v":0.5135000000000001,"d":"0.51"},{"v":0,"d":"0 m"},{"v":0,"d":"0 m"},"Hypoxie",""]
[1.4,4,"m",{"v":0.294,"d":"0.29"},{"v":1.1059999999999999,"d":"1.11"},{"v":3.9999999999999982,"d":"4 m"},"","",null,4,"m",{"v":0.147,"d":"0.15"},{"v":0.5529999999999999,"d":"0.55"},{"v":0,"d":"0 m"},{"v":0,"d":"0 m"},"Hypoxie",""]
[1.5,5,"m",{"v":0.315,"d":"0.32"},{"v":1.185,"d":"1.19"},{"v":5.000000000000002,"d":"5 m"},"","",null,5,"m",{"v":0.1575,"d":"0.16"},{"v":0.5925,"d":"0.59"},{"v":0,"d":"0 m"},{"v":0,"d":"0 m"},"Hypoxie",""]
[1.6,6,"m",{"v":0.336,"d":"0.34"},{"v":1.264,"d":"1.26"},{"v":6,"d":"6 m"},"","",null,6,"m",{"v":0.168,"d":"0.17"},{"v":0.632,"d":"0.63"},{"v":0,"d":"0 m"},{"v":0,"d":"0 m"},"Hypoxie",""]
[1.7,7,"m",{"v":0.357,"d":"0.36"},{"v":1.3429999999999997,"d":"1.34"},{"v":6.9999999999999964,"d":"7 m"},"","",null,7,"m",{"v":0.1785,"d":"0.18"},{"v":0.6714999999999999,"d":"0.67"},{"v":0,"d":"0 m"},{"v":-0.3247448305861518,"d":"-0 m"},"Hypoxie",""]
[1.8,8,"m",{"v":0.37800000000000006,"d":"0.38"},{"v":1.4220000000000002,"d":"1.42"},{"v":8.000000000000004,"d":"8 m"},"","",null,8,"m",{"v":0.18900000000000003,"d":"0.19"},{"v":0.7110000000000001,"d":"0.71"},{"v":0,"d":"0 m"},{"v":0.24438782643819223,"d":"0 m"},"Hypoxie",""]
[1.9,9,"m",{"v":0.39899999999999997,"d":"0.40"},{"v":1.501,"d":"1.50"},{"v":8.999999999999996,"d":"9 m"},"","",null,9,"m",{"v":0.19949999999999998,"d":"0.20"},{"v":0.7505,"d":"0.75"},{"v":0,"d":"0 m"},{"v":0.813520483462538,"d":"1 m"},"",""]
[2,10,"m",0.42,1.58,{"v":10,"d":"10 m"},"","",null,10,"m",0.21,0.79,{"v":0,"d":"0 m"},{"v":1.382653140486882,"d":"1 m"},"",""]
[2.1,11,"m",{"v":0.441,"d":"0.44"},{"v":1.659,"d":"1.66"},{"v":11,"d":"11 m"},"","",null,11,"m",{"v":0.2205,"d":"0.22"},{"v":0.8295,"d":"0.83"},{"v":0.5,"d":"1 m"},{"v":1.9517857975112243,"d":"2 m"},"",""]
[2.2,12,"m",{"v":0.462,"d":"0.46"},{"v":1.7380000000000002,"d":"1.74"},{"v":12.000000000000004,"d":"12 m"},"","",null,12,"m",{"v":0.231,"d":"0.23"},{"v":0.8690000000000001,"d":"0.87"},{"v":1.0000000000000018,"d":"1 m"},{"v":2.52091845453557,"d":"3 m"},"",""]
[2.3,13,"m",{"v":0.483,"d":"0.48"},{"v":1.817,"d":"1.82"},{"v":12.999999999999996,"d":"13 m"},"","",null,13,"m",{"v":0.2415,"d":"0.24"},{"v":0.9085,"d":"0.91"},{"v":1.4999999999999982,"d":"2 m"},{"v":3.0900511115599123,"d":"3 m"},"",""]
[2.4,14,"m",{"v":0.504,"d":"0.50"},{"v":1.896,"d":"1.90"},{"v":14,"d":"14 m"},"","",null,14,"m",{"v":0.252,"d":"0.25"},{"v":0.948,"d":"0.95"},{"v":2,"d":"2 m"},{"v":3.659183768584258,"d":"4 m"},"",""]
[2.5,15,"m",{"v":0.525,"d":"0.53"},{"v":1.975,"d":"1.98"},{"v":15,"d":"15 m"},"","",null,15,"m",{"v":0.2625,"d":"0.26"},{"v":0.9875,"d":"0.99"},{"v":2.5,"d":"3 m"},{"v":4.2283164256086,"d":"4 m"},"",""]
[2.6,16,"m",{"v":0.546,"d":"0.55"},{"v":2.0540000000000003,"d":"2.05"},{"v":16.000000000000004,"d":"16 m"},"","",null,16,"m",{"v":0.273,"d":"0.27"},{"v":1.0270000000000001,"d":"1.03"},{"v":3.0000000000000018,"d":"3 m"},{"v":4.797449082632948,"d":"5 m"},"",""]
[2.7,17,"m",{"v":0.5670000000000001,"d":"0.57"},{"v":2.133,"d":"2.13"},{"v":16.999999999999996,"d":"17 m"},"","",null,17,"m",{"v":0.28350000000000003,"d":"0.28"},{"v":1.0665,"d":"1.07"},{"v":3.4999999999999982,"d":"4 m"},{"v":5.366581739657292,"d":"5 m"},"",""]
[2.8,18,"m",{"v":0.588,"d":"0.59"},{"v":2.2119999999999997,"d":"2.21"},{"v":17.999999999999996,"d":"18 m"},"","",null,18,"m",{"v":0.294,"d":"0.29"},{"v":1.1059999999999999,"d":"1.11"},{"v":3.9999999999999982,"d":"4 m"},{"v":5.935714396681632,"d":"6 m"},"",""]
[2.9,19,"m",{"v":0.609,"d":"0.61"},{"v":2.291,"d":"2.29"},{"v":19,"d":"19 m"},"","",null,19,"m",{"v":0.3045,"d":"0.30"},{"v":1.1455,"d":"1.15"},{"v":4.5,"d":"5 m"},{"v":6.504847053705976,"d":"7 m"},"",""]
[3,20,"m",0.63,2.37,{"v":20.000000000000004,"d":"20 m"},"","",null,20,"m",{"v":0.315,"d":"0.32"},{"v":1.185,"d":"1.19"},{"v":5.000000000000002,"d":"5 m"},{"v":7.073979710730324,"d":"7 m"},"",""]
[3.1,21,"m",{"v":0.6510000000000001,"d":"0.65"},{"v":2.449,"d":"2.45"},{"v":20.999999999999996,"d":"21 m"},"","",null,21,"m",{"v":0.32550000000000007,"d":"0.33"},{"v":1.2245,"d":"1.22"},{"v":5.499999999999998,"d":"6 m"},{"v":7.643112367754668,"d":"8 m"},"",""]
[3.2,22,"m",{"v":0.672,"d":"0.67"},{"v":2.528,"d":"2.53"},{"v":22,"d":"22 m"},"","",null,22,"m",{"v":0.336,"d":"0.34"},{"v":1.264,"d":"1.26"},{"v":6,"d":"6 m"},{"v":8.212245024779012,"d":"8 m"},"",""]
[3.3,23,"m",{"v":0.693,"d":"0.69"},{"v":2.6069999999999998,"d":"2.61"},{"v":22.999999999999993,"d":"23 m"},"","",null,23,"m",{"v":0.3465,"d":"0.35"},{"v":1.3034999999999999,"d":"1.30"},{"v":6.4999999999999964,"d":"7 m"},{"v":8.781377681803356,"d":"9 m"},"",""]
[3.4,24,"m",{"v":0.714,"d":"0.71"},{"v":2.6859999999999995,"d":"2.69"},{"v":23.999999999999993,"d":"24 m"},"","",null,24,"m",{"v":0.357,"d":"0.36"},{"v":1.3429999999999997,"d":"1.34"},{"v":6.9999999999999964,"d":"7 m"},{"v":9.350510338827696,"d":"9 m"},"",""]
[3.5,25,"m",{"v":0.735,"d":"0.74"},{"v":2.765,"d":"2.77"},{"v":25,"d":"25 m"},"","",null,25,"m",{"v":0.3675,"d":"0.37"},{"v":1.3825,"d":"1.38"},{"v":7.5,"d":"8 m"},{"v":9.919642995852044,"d":"10 m"},"",""]
[3.6,26,"m",{"v":0.7560000000000001,"d":"0.76"},{"v":2.8440000000000003,"d":"2.84"},{"v":26.000000000000007,"d":"26 m"},"","",null,26,"m",{"v":0.37800000000000006,"d":"0.38"},{"v":1.4220000000000002,"d":"1.42"},{"v":8.000000000000004,"d":"8 m"},{"v":10.488775652876384,"d":"10 m"},"",""]
[3.7,27,"m",{"v":0.777,"d":"0.78"},{"v":2.923,"d":"2.92"},{"v":27,"d":"27 m"},"","",null,27,"m",{"v":0.3885,"d":"0.39"},{"v":1.4615,"d":"1.46"},{"v":8.5,"d":"9 m"},{"v":11.057908309900732,"d":"11 m"},"",""]
[3.8,28,"m",{"v":0.7979999999999999,"d":"0.80"},{"v":3.002,"d":"3.00"},{"v":27.999999999999993,"d":"28 m"},"","",null,28,"m",{"v":0.39899999999999997,"d":"0.40"},{"v":1.501,"d":"1.50"},{"v":8.999999999999996,"d":"9 m"},{"v":11.627040966925076,"d":"12 m"},"",""]
[3.9,29,"m",{"v":0.819,"d":"0.82"},{"v":3.0809999999999995,"d":"3.08"},{"v":28.999999999999993,"d":"29 m"},"","",null,29,"m",{"v":0.4095,"d":"0.41"},{"v":1.5404999999999998,"d":"1.54"},{"v":9.499999999999996,"d":"10 m"},{"v":12.196173623949417,"d":"12 m"},"",""]
[4,30,"m",0.84,3.16,{"v":30,"d":"30 m"},"","",null,30,"m",0.42,1.58,{"v":10,"d":"10 m"},{"v":12.765306280973764,"d":"13 m"},"",""]
[4.1,31,"m",{"v":0.861,"d":"0.86"},{"v":3.239,"d":"3.24"},{"v":31,"d":"31 m"},"","",null,31,"m",{"v":0.4305,"d":"0.43"},{"v":1.6195,"d":"1.62"},{"v":10.5,"d":"11 m"},{"v":13.334438937998105,"d":"13 m"},"",""]
[4.2,32,"m",{"v":0.882,"d":"0.88"},{"v":3.318,"d":"3.32"},{"v":32,"d":"32 m"},"","",null,32,"m",{"v":0.441,"d":"0.44"},{"v":1.659,"d":"1.66"},{"v":11,"d":"11 m"},{"v":13.903571595022449,"d":"14 m"},"",""]
[4.3,33,"m",{"v":0.903,"d":"0.90"},{"v":3.397,"d":"3.40"},{"v":33,"d":"33 m"},"","",null,33,"m",{"v":0.4515,"d":"0.45"},{"v":1.6985,"d":"1.70"},{"v":11.5,"d":"12 m"},{"v":14.472704252046796,"d":"14 m"},"",""]
[4.4,34,"m",{"v":0.924,"d":"0.92"},{"v":3.4760000000000004,"d":"3.48"},{"v":34.00000000000001,"d":"34 m"},"","",null,34,"m",{"v":0.462,"d":"0.46"},{"v":1.7380000000000002,"d":"1.74"},{"v":12.000000000000004,"d":"12 m"},{"v":15.04183690907114,"d":"15 m"},"",""]
[4.5,35,"m",{"v":0.945,"d":"0.95"},{"v":3.555,"d":"3.56"},{"v":35,"d":"35 m"},"","",null,35,"m",{"v":0.4725,"d":"0.47"},{"v":1.7775,"d":"1.78"},{"v":12.5,"d":"13 m"},{"v":15.61096956609548,"d":"16 m"},"",""]
[4.6,36,"m",{"v":0.966,"d":"0.97"},{"v":3.634,"d":"3.63"},{"v":35.99999999999999,"d":"36 m"},"","pne>35m",null,36,"m",{"v":0.483,"d":"0.48"},{"v":1.817,"d":"1.82"},{"v":12.999999999999996,"d":"13 m"},{"v":16.180102223119825,"d":"16 m"},"",""]
[4.7,37,"m",{"v":0.987,"d":"0.99"},{"v":3.713,"d":"3.71"},{"v":37,"d":"37 m"},"","pne>35m",null,37,"m",{"v":0.4935,"d":"0.49"},{"v":1.8565,"d":"1.86"},{"v":13.5,"d":"14 m"},{"v":16.749234880144172,"d":"17 m"},"",""]
[4.8,38,"m",{"v":1.008,"d":"1.01"},{"v":3.792,"d":"3.79"},{"v":38,"d":"38 m"},"","pne>35m",null,38,"m",{"v":0.504,"d":"0.50"},{"v":1.896,"d":"1.90"},{"v":14,"d":"14 m"},{"v":17.318367537168516,"d":"17 m"},"",""]
[4.9,39,"m",{"v":1.0290000000000001,"d":"1.03"},{"v":3.8710000000000004,"d":"3.87"},{"v":39.00000000000001,"d":"39 m"},"","pne>35m",null,39,"m",{"v":0.5145000000000001,"d":"0.51"},{"v":1.9355000000000002,"d":"1.94"},{"v":14.500000000000004,"d":"15 m"},{"v":17.887500194192864,"d":"18 m"},"",""]
[5,40,"m",1.05,3.95,{"v":40,"d":"40 m"},"","pne>35m",null,40,"m",{"v":0.525,"d":"0.53"},{"v":1.975,"d":"1.98"},{"v":15,"d":"15 m"},{"v":18.4566328512172,"d":"18 m"},"",""]
[5.1,41,"m",{"v":1.071,"d":"1.07"},{"v":4.029,"d":"4.03"},{"v":41,"d":"41 m"},"","pne>35m",null,41,"m",{"v":0.5355,"d":"0.54"},{"v":2.0145,"d":"2.01"},{"v":15.5,"d":"16 m"},{"v":19.025765508241545,"d":"19 m"},"",""]
[5.2,42,"m",{"v":1.092,"d":"1.09"},{"v":4.1080000000000005,"d":"4.11"},{"v":42.00000000000001,"d":"42 m"},"","pne>35m",null,42,"m",{"v":0.546,"d":"0.55"},{"v":2.0540000000000003,"d":"2.05"},{"v":16.000000000000004,"d":"16 m"},{"v":19.594898165265896,"d":"20 m"},"",""]
[5.3,43,"m",{"v":1.113,"d":"1.11"},{"v":4.187,"d":"4.19"},{"v":43,"d":"43 m"},"","pne>35m",null,43,"m",{"v":0.5565,"d":"0.56"},{"v":2.0935,"d":"2.09"},{"v":16.5,"d":"17 m"},{"v":20.164030822290236,"d":"20 m"},"",""]
[5.4,44,"m",{"v":1.1340000000000001,"d":"1.13"},{"v":4.266,"d":"4.27"},{"v":43.99999999999999,"d":"44 m"},"","pne>35m",null,44,"m",{"$f":"((J94/10)+1)*$D$22/100","v":{"v":0.5670000000000001,"d":"0.57"}},{"v":2.133,"d":"2.13"},{"v":16.999999999999996,"d":"17 m"},{"v":20.733163479314584,"d":"21 m"},{"$f":"IF(L94>1.47,\"Hyperoxie\",IF(L94<0.19,\"Hypoxie\",\"\"))","v":""},""]
[5.5,45,"m",{"v":1.155,"d":"1.16"},{"v":4.345,"d":"4.35"},{"v":44.99999999999999,"d":"45 m"},"","pne>35m",null,45,"m",{"v":0.5775,"d":"0.58"},{"v":2.1725,"d":"2.17"},{"v":17.499999999999996,"d":"18 m"},{"v":21.30229613633892,"d":"21 m"},"",""]
[5.6,46,"m",{"v":1.176,"d":"1.18"},{"v":4.4239999999999995,"d":"4.42"},{"v":45.99999999999999,"d":"46 m"},"","pne>35m",null,46,"m",{"v":0.588,"d":"0.59"},{"v":2.2119999999999997,"d":"2.21"},{"v":17.999999999999996,"d":"18 m"},{"v":21.871428793363265,"d":"22 m"},"",""]
[5.7,47,"m",{"v":1.197,"d":"1.20"},{"v":4.503,"d":"4.50"},{"v":47,"d":"47 m"},"","pne>35m",null,47,"m",{"v":0.5985,"d":"0.60"},{"v":2.2515,"d":"2.25"},{"v":18.5,"d":"19 m"},{"v":22.440561450387612,"d":"22 m"},"",""]
[5.8,48,"m",{"v":1.218,"d":"1.22"},{"v":4.582,"d":"4.58"},{"v":48,"d":"48 m"},"","pne>35m",null,48,"m",{"v":0.609,"d":"0.61"},{"v":2.291,"d":"2.29"},{"v":19,"d":"19 m"},{"v":23.009694107411953,"d":"23 m"},"",""]
[5.9,49,"m",{"v":1.239,"d":"1.24"},{"v":4.6610000000000005,"d":"4.66"},{"v":49.00000000000001,"d":"49 m"},"","pne>35m",null,49,"m",{"v":0.6195,"d":"0.62"},{"v":2.3305000000000002,"d":"2.33"},{"v":19.500000000000004,"d":"20 m"},{"v":23.578826764436307,"d":"24 m"},"",""]
[6,50,"m",1.26,4.74,{"v":50.00000000000001,"d":"50 m"},"","pne>35m",null,50,"m",0.63,2.37,{"v":20.000000000000004,"d":"20 m"},{"v":24.147959421460648,"d":"24 m"},"",""]
[6.1,51,"m",{"v":1.281,"d":"1.28"},{"v":4.819,"d":"4.82"},{"v":50.99999999999999,"d":"51 m"},"","pne>35m",null,51,"m",{"v":0.6405,"d":"0.64"},{"v":2.4095,"d":"2.41"},{"v":20.499999999999996,"d":"21 m"},{"$f":"(((((($E$18%*1.428)+($F$18%*0.178)+($D$21%*1.25))*A101))/1.28738)*10)-10","v":{"v":24.71709207848499,"d":"25 m"}},"",""]
[6.2,52,"m",{"v":1.3020000000000003,"d":"1.30"},{"v":4.898,"d":"4.90"},{"v":51.99999999999999,"d":"52 m"},"","pne>35m",null,52,"m",{"v":0.6510000000000001,"d":"0.65"},{"v":2.449,"d":"2.45"},{"v":20.999999999999996,"d":"21 m"},{"v":25.286224735509336,"d":"25 m"},"",""]
[6.3,53,"m",{"v":1.3229999999999997,"d":"1.32"},{"v":4.977,"d":"4.98"},{"v":53,"d":"53 m"},"","pne>35m",null,53,"m",{"v":0.6614999999999999,"d":"0.66"},{"v":2.4885,"d":"2.49"},{"v":21.5,"d":"22 m"},{"v":25.855357392533676,"d":"26 m"},"",""]
[6.4,54,"m",{"v":1.344,"d":"1.34"},{"v":5.056,"d":"5.06"},{"v":54,"d":"54 m"},"","pne>35m",null,54,"m",{"v":0.672,"d":"0.67"},{"v":2.528,"d":"2.53"},{"v":22,"d":"22 m"},{"v":26.424490049558024,"d":"26 m"},"",""]
[6.5,55,"m",{"v":1.365,"d":"1.37"},{"v":5.135,"d":"5.14"},{"v":54.999999999999986,"d":"55 m"},"","pne>35m",null,55,"m",{"v":0.6825,"d":"0.68"},{"v":2.5675,"d":"2.57"},{"v":22.499999999999993,"d":"23 m"},{"v":26.99362270658237,"d":"27 m"},"",""]
[6.6,56,"m",{"v":1.386,"d":"1.39"},{"v":5.2139999999999995,"d":"5.21"},{"v":55.999999999999986,"d":"56 m"},"","pne>35m",null,56,"m",{"v":0.693,"d":"0.69"},{"v":2.6069999999999998,"d":"2.61"},{"v":22.999999999999993,"d":"23 m"},{"v":27.562755363606712,"d":"28 m"},"",""]
[6.7,57,"m",{"v":1.4070000000000003,"d":"1.41"},{"v":5.293000000000001,"d":"5.29"},{"v":57,"d":"57 m"},"","pne>35m",null,57,"m",{"v":0.7035000000000001,"d":"0.70"},{"v":2.6465000000000005,"d":"2.65"},{"v":23.5,"d":"24 m"},{"v":28.131888020631052,"d":"28 m"},"",""]
[6.8,58,"m",{"v":1.428,"d":"1.43"},{"v":5.371999999999999,"d":"5.37"},{"v":57.999999999999986,"d":"58 m"},"","pne>35m",null,58,"m",{"v":0.714,"d":"0.71"},{"v":2.6859999999999995,"d":"2.69"},{"v":23.999999999999993,"d":"24 m"},{"v":28.701020677655393,"d":"29 m"},"",""]
[6.9,59,"m",{"v":1.449,"d":"1.45"},{"v":5.4510000000000005,"d":"5.45"},{"v":59,"d":"59 m"},"","pne>35m",null,59,"m",{"v":0.7245,"d":"0.72"},{"v":2.7255000000000003,"d":"2.73"},{"v":24.5,"d":"25 m"},{"v":29.270153334679748,"d":"29 m"},"",""]
[7,60,"m",1.47,5.53,{"v":60,"d":"60 m"},"","pne>35m",null,60,"m",{"v":0.735,"d":"0.74"},{"v":2.765,"d":"2.77"},{"v":25,"d":"25 m"},{"v":29.839285991704088,"d":"30 m"},"",""]
[7.1,61,"m",{"v":1.4909999999999999,"d":"1.49"},{"v":5.609,"d":"5.61"},{"v":61,"d":"61 m"},"Hyperoxie","Narcose",null,61,"m",{"v":0.7454999999999999,"d":"0.75"},{"v":2.8045,"d":"2.80"},{"v":25.5,"d":"26 m"},{"v":30.40841864872843,"d":"30 m"},"",""]
[7.2,62,"m",{"v":1.5120000000000002,"d":"1.51"},{"v":5.688000000000001,"d":"5.69"},{"v":62.000000000000014,"d":"62 m"},"Hyperoxie","Narcose",null,62,"m",{"v":0.7560000000000001,"d":"0.76"},{"v":2.8440000000000003,"d":"2.84"},{"v":26.000000000000007,"d":"26 m"},{"v":30.97755130575277,"d":"31 m"},"",""]
[7.3,63,"m",{"v":1.533,"d":"1.53"},{"v":5.7669999999999995,"d":"5.77"},{"v":62.999999999999986,"d":"63 m"},"Hyperoxie","Narcose",null,63,"m",{"v":0.7665,"d":"0.77"},{"v":2.8834999999999997,"d":"2.88"},{"v":26.499999999999993,"d":"27 m"},{"v":31.54668396277711,"d":"32 m"},"",""]
[7.4,64,"m",{"$f":"((B114/10)+1)*$N$31/100","v":{"v":1.554,"d":"1.55"}},{"$f":"((B114/10)+1)*$N$33/100","v":{"v":5.846,"d":"5.85"}},{"v":64,"d":"64 m"},"Hyperoxie","Narcose",null,64,"m",{"v":0.777,"d":"0.78"},{"v":2.923,"d":"2.92"},{"v":27,"d":"27 m"},{"v":32.115816619801464,"d":"32 m"},"",""]
[7.5,65,"m",{"v":1.575,"d":"1.58"},{"v":5.925,"d":"5.93"},{"$f":"IF(E115<0.79,0,(10*E115)/0.79-7.9/0.79)","v":{"v":65,"d":"65 m"}},{"$f":"IF(D115>1.47,\"Hyperoxie\",IF(D115<0.19,\"Hypoxie\",\"\"))","v":"Hyperoxie"},{"$f":"IF(E115>5.53,\"Narcose\",IF(E115>3.56,\"pne>35m\",\"\"))","v":"Narcose"},null,65,"m",{"$f":"((J115/10)+1)*$D$22/100","v":{"v":0.7875,"d":"0.79"}},{"$f":"((J115/10)+1)*$D$21/100","v":{"v":2.9625,"d":"2.96"}},{"$f":"IF(M115<0.79,0,(10*M115)/0.79-7.9/0.79)","v":{"v":27.5,"d":"28 m"}},{"$f":"(((((($E$18%*1.428)+($F$18%*0.178)+($D$21%*1.25))*A115))/1.28738)*10)-10","v":{"v":32.68494927682581,"d":"33 m"}},{"$f":"IF(L115>1.47,\"Hyperoxie\",IF(L115<0.19,\"Hypoxie\",\"\"))","v":""},{"$f":"IF(M115>5.53,\"Narcose\",IF(M115>3.56,\"pne > 35m\",\"\"))","v":""}]
[{"$f":"(B116/10)+1","v":7.6},66,"m",{"v":1.5959999999999999,"d":"1.60"},{"v":6.004,"d":"6.00"},{"v":65.99999999999999,"d":"66 m"},"Hyperoxie","Narcose",null,66,"m",{"v":0.7979999999999999,"d":"0.80"},{"v":3.002,"d":"3.00"},{"v":27.999999999999993,"d":"28 m"},{"v":33.25408193385015,"d":"33 m"},"",""]
[7.7,67,"m",{"v":1.6170000000000002,"d":"1.62"},{"v":6.083000000000001,"d":"6.08"},{"v":67.00000000000001,"d":"67 m"},"Hyperoxie","Narcose",null,67,"m",{"v":0.8085000000000001,"d":"0.81"},{"v":3.0415000000000005,"d":"3.04"},{"v":28.500000000000007,"d":"29 m"},{"v":33.82321459087449,"d":"34 m"},"",""]
[7.8,68,"m",{"v":1.638,"d":"1.64"},{"v":6.161999999999999,"d":"6.16"},{"v":67.99999999999999,"d":"68 m"},"Hyperoxie","Narcose",null,68,"m",{"v":0.819,"d":"0.82"},{"v":3.0809999999999995,"d":"3.08"},{"v":28.999999999999993,"d":"29 m"},{"v":34.39234724789883,"d":"34 m"},"",""]
[7.9,69,"m",{"v":1.659,"d":"1.66"},{"v":6.2410000000000005,"d":"6.24"},{"v":69,"d":"69 m"},"Hyperoxie","Narcose",null,69,"m",{"v":0.8295,"d":"0.83"},{"v":3.1205000000000003,"d":"3.12"},{"v":29.5,"d":"30 m"},{"v":34.96147990492318,"d":"35 m"},"",""]
[8,70,"m",1.68,6.32,{"v":70,"d":"70 m"},"Hyperoxie","Narcose",null,70,"m",0.84,3.16,{"v":30,"d":"30 m"},{"v":35.53061256194753,"d":"36 m"},"",""]
[8.1,71,"m",{"v":1.7009999999999998,"d":"1.70"},{"v":6.399,"d":"6.40"},{"v":71,"d":"71 m"},"Hyperoxie","Narcose",null,71,"m",{"v":0.8504999999999999,"d":"0.85"},{"v":3.1995,"d":"3.20"},{"v":30.5,"d":"31 m"},{"v":36.09974521897187,"d":"36 m"},"",""]
[8.2,72,"m",{"v":1.722,"d":"1.72"},{"v":6.478,"d":"6.48"},{"v":72,"d":"72 m"},"Hyperoxie","Narcose",null,72,"m",{"v":0.861,"d":"0.86"},{"v":3.239,"d":"3.24"},{"v":31,"d":"31 m"},{"v":36.66887787599621,"d":"37 m"},"",""]
[8.3,73,"m",{"v":1.743,"d":"1.74"},{"v":6.557,"d":"6.56"},{"v":73,"d":"73 m"},"Hyperoxie","Narcose",null,73,"m",{"v":0.8715,"d":"0.87"},{"v":3.2785,"d":"3.28"},{"v":31.5,"d":"32 m"},{"v":37.23801053302056,"d":"37 m"},"",""]
[8.4,74,"m",{"v":1.764,"d":"1.76"},{"v":6.636,"d":"6.64"},{"v":74,"d":"74 m"},"Hyperoxie","Narcose",null,74,"m",{"v":0.882,"d":"0.88"},{"v":3.318,"d":"3.32"},{"v":32,"d":"32 m"},{"v":37.8071431900449,"d":"38 m"},"",""]
[8.5,75,"m",{"v":1.785,"d":"1.79"},{"v":6.715,"d":"6.72"},{"v":75,"d":"75 m"},"Hyperoxie","Narcose",null,75,"m",{"v":0.8925,"d":"0.89"},{"v":3.3575,"d":"3.36"},{"v":32.5,"d":"33 m"},{"v":38.37627584706925,"d":"38 m"},"",""]
[8.6,76,"m",{"v":1.806,"d":"1.81"},{"v":6.794,"d":"6.79"},{"v":76,"d":"76 m"},"Hyperoxie","Narcose",null,76,"m",{"v":0.903,"d":"0.90"},{"v":3.397,"d":"3.40"},{"v":33,"d":"33 m"},{"v":38.94540850409359,"d":"39 m"},"",""]
[8.7,77,"m",{"v":1.827,"d":"1.83"},{"v":6.872999999999999,"d":"6.87"},{"v":76.99999999999999,"d":"77 m"},"Hyperoxie","Narcose",null,77,"m",{"v":0.9135,"d":"0.91"},{"v":3.4364999999999997,"d":"3.44"},{"v":33.49999999999999,"d":"34 m"},{"v":39.51454116111793,"d":"40 m"},"",""]
[8.8,78,"m",{"v":1.848,"d":"1.85"},{"v":6.952000000000001,"d":"6.95"},{"v":78.00000000000001,"d":"78 m"},"Hyperoxie","Narcose",null,78,"m",{"v":0.924,"d":"0.92"},{"v":3.4760000000000004,"d":"3.48"},{"v":34.00000000000001,"d":"34 m"},{"v":40.08367381814228,"d":"40 m"},"",""]
[8.9,79,"m",{"v":1.869,"d":"1.87"},{"v":7.031000000000001,"d":"7.03"},{"v":79,"d":"79 m"},"Hyperoxie","Narcose",null,79,"m",{"v":0.9345,"d":"0.93"},{"v":3.5155000000000003,"d":"3.52"},{"v":34.5,"d":"35 m"},{"v":40.65280647516662,"d":"41 m"},"",""]
[9,80,"m",1.89,7.11,{"v":80,"d":"80 m"},"Hyperoxie","Narcose",null,80,"m",{"v":0.945,"d":"0.95"},{"v":3.555,"d":"3.56"},{"v":35,"d":"35 m"},{"v":41.22193913219096,"d":"41 m"},"",""]
[9.1,81,"m",{"v":1.911,"d":"1.91"},{"v":7.189,"d":"7.19"},{"v":81,"d":"81 m"},"Hyperoxie","Narcose",null,81,"m",{"v":0.9555,"d":"0.96"},{"v":3.5945,"d":"3.59"},{"v":35.5,"d":"36 m"},{"v":41.79107178921531,"d":"42 m"},"","pne > 35m"]
[9.2,82,"m",{"v":1.932,"d":"1.93"},{"v":7.268,"d":"7.27"},{"v":81.99999999999999,"d":"82 m"},"Hyperoxie","Narcose",null,82,"m",{"v":0.966,"d":"0.97"},{"v":3.634,"d":"3.63"},{"v":35.99999999999999,"d":"36 m"},{"v":42.36020444623965,"d":"42 m"},"","pne > 35m"]
[9.3,83,"m",{"v":1.953,"d":"1.95"},{"v":7.347,"d":"7.35"},{"v":83,"d":"83 m"},"Hyperoxie","Narcose",null,83,"m",{"v":0.9765,"d":"0.98"},{"v":3.6735,"d":"3.67"},{"v":36.5,"d":"37 m"},{"v":42.92933710326401,"d":"43 m"},"","pne > 35m"]
[9.4,84,"m",{"v":1.974,"d":"1.97"},{"v":7.426,"d":"7.43"},{"v":84,"d":"84 m"},"Hyperoxie","Narcose",null,84,"m",{"v":0.987,"d":"0.99"},{"v":3.713,"d":"3.71"},{"v":37,"d":"37 m"},{"v":43.498469760288344,"d":"43 m"},"","pne > 35m"]
[9.5,85,"m",{"v":1.995,"d":"2.00"},{"v":7.505,"d":"7.51"},{"v":84.99999999999999,"d":"85 m"},"Hyperoxie","Narcose",null,85,"m",{"v":0.9975,"d":"1.00"},{"v":3.7525,"d":"3.75"},{"v":37.49999999999999,"d":"38 m"},{"v":44.067602417312685,"d":"44 m"},"","pne > 35m"]
[9.6,86,"m",{"v":2.016,"d":"2.02"},{"v":7.584,"d":"7.58"},{"v":86,"d":"86 m"},"Hyperoxie","Narcose",null,86,"m",{"v":1.008,"d":"1.01"},{"v":3.792,"d":"3.79"},{"v":38,"d":"38 m"},{"v":44.63673507433703,"d":"45 m"},"","pne > 35m"]
[9.7,87,"m",{"v":2.037,"d":"2.04"},{"v":7.662999999999999,"d":"7.66"},{"v":86.99999999999999,"d":"87 m"},"Hyperoxie","Narcose",null,87,"m",{"v":1.0185,"d":"1.02"},{"v":3.8314999999999997,"d":"3.83"},{"v":38.49999999999999,"d":"39 m"},{"v":45.20586773136137,"d":"45 m"},"","pne > 35m"]
[9.8,88,"m",{"v":2.0580000000000003,"d":"2.06"},{"v":7.742000000000001,"d":"7.74"},{"v":88.00000000000001,"d":"88 m"},"Hyperoxie","Narcose",null,88,"m",{"v":1.0290000000000001,"d":"1.03"},{"v":3.8710000000000004,"d":"3.87"},{"v":39.00000000000001,"d":"39 m"},{"v":45.77500038838573,"d":"46 m"},"","pne > 35m"]
[9.9,89,"m",{"v":2.079,"d":"2.08"},{"v":7.821000000000001,"d":"7.82"},{"v":89,"d":"89 m"},"Hyperoxie","Narcose",null,89,"m",{"v":1.0395,"d":"1.04"},{"v":3.9105000000000003,"d":"3.91"},{"v":39.5,"d":"40 m"},{"v":46.34413304541007,"d":"46 m"},"","pne > 35m"]
[10,90,"m",{"v":2.1,"d":"2.10"},{"v":7.9,"d":"7.90"},{"v":90,"d":"90 m"},"Hyperoxie","Narcose",null,90,"m",1.05,3.95,{"v":40,"d":"40 m"},{"v":46.9132657024344,"d":"47 m"},"","pne > 35m"]
[10.1,91,"m",{"v":2.121,"d":"2.12"},{"v":7.979,"d":"7.98"},{"v":91,"d":"91 m"},"Hyperoxie","Narcose",null,91,"m",{"v":1.0605,"d":"1.06"},{"v":3.9895,"d":"3.99"},{"v":40.5,"d":"41 m"},{"v":47.48239835945875,"d":"47 m"},"","pne > 35m"]
[10.2,92,"m",{"v":2.142,"d":"2.14"},{"v":8.058,"d":"8.06"},{"v":92,"d":"92 m"},"Hyperoxie","Narcose",null,92,"m",{"v":1.071,"d":"1.07"},{"v":4.029,"d":"4.03"},{"v":41,"d":"41 m"},{"v":48.05153101648309,"d":"48 m"},"","pne > 35m"]
[10.3,93,"m",{"v":2.1630000000000003,"d":"2.16"},{"v":8.137,"d":"8.14"},{"v":93,"d":"93 m"},"Hyperoxie","Narcose",null,93,"m",{"v":1.0815000000000001,"d":"1.08"},{"v":4.0685,"d":"4.07"},{"v":41.5,"d":"42 m"},{"v":48.62066367350745,"d":"49 m"},"","pne > 35m"]
[10.4,94,"m",{"v":2.184,"d":"2.18"},{"v":8.216000000000001,"d":"8.22"},{"v":94.00000000000001,"d":"94 m"},"Hyperoxie","Narcose",null,94,"m",{"v":1.092,"d":"1.09"},{"v":4.1080000000000005,"d":"4.11"},{"v":42.00000000000001,"d":"42 m"},{"v":49.18979633053179,"d":"49 m"},"","pne > 35m"]
[10.5,95,"m",{"v":2.205,"d":"2.21"},{"v":8.295,"d":"8.30"},{"v":95,"d":"95 m"},"Hyperoxie","Narcose",null,95,"m",{"v":1.1025,"d":"1.10"},{"v":4.1475,"d":"4.15"},{"v":42.5,"d":"43 m"},{"v":49.75892898755613,"d":"50 m"},"","pne > 35m"]
[10.6,96,"m",{"v":2.226,"d":"2.23"},{"v":8.374,"d":"8.37"},{"v":96,"d":"96 m"},"Hyperoxie","Narcose",null,96,"m",{"v":1.113,"d":"1.11"},{"v":4.187,"d":"4.19"},{"v":43,"d":"43 m"},{"v":50.32806164458047,"d":"50 m"},"","pne > 35m"]
[10.7,97,"m",{"v":2.247,"d":"2.25"},{"v":8.453,"d":"8.45"},{"v":97,"d":"97 m"},"Hyperoxie","Narcose",null,97,"m",{"v":1.1235,"d":"1.12"},{"v":4.2265,"d":"4.23"},{"v":43.5,"d":"44 m"},{"v":50.89719430160481,"d":"51 m"},"","pne > 35m"]
[10.8,98,"m",{"v":2.2680000000000002,"d":"2.27"},{"v":8.532,"d":"8.53"},{"v":97.99999999999999,"d":"98 m"},"Hyperoxie","Narcose",null,98,"m",{"v":1.1340000000000001,"d":"1.13"},{"v":4.266,"d":"4.27"},{"v":43.99999999999999,"d":"44 m"},{"v":51.46632695862917,"d":"51 m"},"","pne > 35m"]
[10.9,99,"m",{"v":2.289,"d":"2.29"},{"v":8.611,"d":"8.61"},{"v":99.00000000000001,"d":"99 m"},"Hyperoxie","Narcose",null,99,"m",{"v":1.1445,"d":"1.14"},{"v":4.3055,"d":"4.31"},{"v":44.50000000000001,"d":"45 m"},{"v":52.03545961565351,"d":"52 m"},"","pne > 35m"]
[11,100,"m",2.31,8.69,{"v":99.99999999999999,"d":"100 m"},"Hyperoxie","Narcose",null,100,"m",{"v":1.155,"d":"1.16"},{"v":4.345,"d":"4.35"},{"v":44.99999999999999,"d":"45 m"},{"v":52.60459227267784,"d":"53 m"},"","pne > 35m"]
[11.1,101,"m",{"v":2.331,"d":"2.33"},{"v":8.769,"d":"8.77"},{"v":100.99999999999999,"d":"101 m"},"Hyperoxie","Narcose",null,101,"m",{"v":1.1655,"d":"1.17"},{"v":4.3845,"d":"4.38"},{"v":45.49999999999999,"d":"46 m"},{"v":53.17372492970218,"d":"53 m"},"","pne > 35m"]
[11.2,102,"m",{"v":2.352,"d":"2.35"},{"v":8.847999999999999,"d":"8.85"},{"v":101.99999999999999,"d":"102 m"},"Hyperoxie","Narcose",null,102,"m",{"v":1.176,"d":"1.18"},{"v":4.4239999999999995,"d":"4.42"},{"v":45.99999999999999,"d":"46 m"},{"v":53.74285758672653,"d":"54 m"},"","pne > 35m"]
[11.3,103,"m",{"v":2.373,"d":"2.37"},{"v":8.927,"d":"8.93"},{"v":102.99999999999999,"d":"103 m"},"Hyperoxie","Narcose",null,103,"m",{"v":1.1865,"d":"1.19"},{"v":4.4635,"d":"4.46"},{"v":46.49999999999999,"d":"47 m"},{"v":54.311990243750884,"d":"54 m"},"","pne > 35m"]
[11.4,104,"m",{"v":2.394,"d":"2.39"},{"v":9.006,"d":"9.01"},{"v":104,"d":"104 m"},"Hyperoxie","Narcose",null,104,"m",{"v":1.197,"d":"1.20"},{"v":4.503,"d":"4.50"},{"v":47,"d":"47 m"},{"v":54.881122900775225,"d":"55 m"},"","pne > 35m"]
[11.5,105,"m",{"v":2.415,"d":"2.42"},{"v":9.085,"d":"9.09"},{"v":105,"d":"105 m"},"Hyperoxie","Narcose",null,105,"m",{"v":1.2075,"d":"1.21"},{"v":4.5425,"d":"4.54"},{"v":47.5,"d":"48 m"},{"v":55.450255557799565,"d":"55 m"},"","pne > 35m"]
[11.6,106,"m",{"v":2.436,"d":"2.44"},{"v":9.164,"d":"9.16"},{"v":106,"d":"106 m"},"Hyperoxie","Narcose",null,106,"m",{"v":1.218,"d":"1.22"},{"v":4.582,"d":"4.58"},{"v":48,"d":"48 m"},{"v":56.019388214823906,"d":"56 m"},"","pne > 35m"]
[11.7,107,"m",{"v":2.457,"d":"2.46"},{"v":9.243,"d":"9.24"},{"v":107,"d":"107 m"},"Hyperoxie","Narcose",null,107,"m",{"v":1.2285,"d":"1.23"},{"v":4.6215,"d":"4.62"},{"v":48.5,"d":"49 m"},{"v":56.588520871848246,"d":"57 m"},"","pne > 35m"]
[11.8,108,"m",{"v":2.478,"d":"2.48"},{"v":9.322000000000001,"d":"9.32"},{"v":108.00000000000001,"d":"108 m"},"Hyperoxie","Narcose",null,108,"m",{"v":1.239,"d":"1.24"},{"v":4.6610000000000005,"d":"4.66"},{"v":49.00000000000001,"d":"49 m"},{"v":57.157653528872615,"d":"57 m"},"","pne > 35m"]
[11.9,109,"m",{"v":2.499,"d":"2.50"},{"v":9.401,"d":"9.40"},{"v":108.99999999999999,"d":"109 m"},"Hyperoxie","Narcose",null,109,"m",{"v":1.2495,"d":"1.25"},{"v":4.7005,"d":"4.70"},{"v":49.49999999999999,"d":"50 m"},{"v":57.726786185896955,"d":"58 m"},"","pne > 35m"]
[12,110,"m",2.52,9.48,{"v":110.00000000000001,"d":"110 m"},"Hyperoxie","Narcose",null,110,"m",1.26,4.74,{"v":50.00000000000001,"d":"50 m"},{"v":58.295918842921296,"d":"58 m"},"","pne > 35m"]
[12.1,111,"m",{"v":2.541,"d":"2.54"},{"v":9.559,"d":"9.56"},{"v":110.99999999999999,"d":"111 m"},"Hyperoxie","Narcose",null,111,"m",{"v":1.2705,"d":"1.27"},{"v":4.7795,"d":"4.78"},{"v":50.49999999999999,"d":"51 m"},{"v":58.86505149994562,"d":"59 m"},"","pne > 35m"]
[12.2,112,"m",{"v":2.562,"d":"2.56"},{"v":9.638,"d":"9.64"},{"v":111.99999999999999,"d":"112 m"},"Hyperoxie","Narcose",null,112,"m",{"v":1.281,"d":"1.28"},{"v":4.819,"d":"4.82"},{"v":50.99999999999999,"d":"51 m"},{"v":59.43418415696998,"d":"59 m"},"","pne > 35m"]
[12.3,113,"m",{"v":2.583,"d":"2.58"},{"v":9.717,"d":"9.72"},{"v":113,"d":"113 m"},"Hyperoxie","Narcose",null,113,"m",{"v":1.2915,"d":"1.29"},{"v":4.8585,"d":"4.86"},{"v":51.5,"d":"52 m"},{"v":60.00331681399432,"d":"60 m"},"","pne > 35m"]
[12.4,114,"m",{"v":2.6040000000000005,"d":"2.60"},{"v":9.796,"d":"9.80"},{"v":113.99999999999999,"d":"114 m"},"Hyperoxie","Narcose",null,114,"m",{"v":1.3020000000000003,"d":"1.30"},{"v":4.898,"d":"4.90"},{"v":51.99999999999999,"d":"52 m"},{"v":60.57244947101867,"d":"61 m"},"","pne > 35m"]
[12.5,115,"m",{"v":2.625,"d":"2.63"},{"v":9.875,"d":"9.88"},{"v":115,"d":"115 m"},"Hyperoxie","Narcose",null,115,"m",{"v":1.3125,"d":"1.31"},{"v":4.9375,"d":"4.94"},{"v":52.5,"d":"53 m"},{"v":61.14158212804301,"d":"61 m"},"","pne > 35m"]
[12.6,116,"m",{"v":2.6459999999999995,"d":"2.65"},{"v":9.954,"d":"9.95"},{"v":116,"d":"116 m"},"Hyperoxie","Narcose",null,116,"m",{"v":1.3229999999999997,"d":"1.32"},{"v":4.977,"d":"4.98"},{"v":53,"d":"53 m"},{"v":61.71071478506735,"d":"62 m"},"","pne > 35m"]
[12.7,117,"m",{"v":2.667,"d":"2.67"},{"v":10.033,"d":"10.03"},{"v":116.99999999999999,"d":"117 m"},"Hyperoxie","Narcose",null,117,"m",{"v":1.3335,"d":"1.33"},{"v":5.0165,"d":"5.02"},{"v":53.49999999999999,"d":"54 m"},{"v":62.27984744209169,"d":"62 m"},"","pne > 35m"]
[12.8,118,"m",{"v":2.688,"d":"2.69"},{"v":10.112,"d":"10.11"},{"v":118,"d":"118 m"},"Hyperoxie","Narcose",null,118,"m",{"v":1.344,"d":"1.34"},{"v":5.056,"d":"5.06"},{"v":54,"d":"54 m"},{"v":62.84898009911605,"d":"63 m"},"","pne > 35m"]
[12.9,119,"m",{"v":2.7090000000000005,"d":"2.71"},{"v":10.191,"d":"10.19"},{"v":119,"d":"119 m"},"Hyperoxie","Narcose",null,119,"m",{"v":1.3545000000000003,"d":"1.35"},{"v":5.0955,"d":"5.10"},{"v":54.5,"d":"55 m"},{"v":63.41811275614039,"d":"63 m"},"","pne > 35m"]
[13,120,"m",2.73,10.27,{"v":119.99999999999997,"d":"120 m"},"Hyperoxie","Narcose",null,120,"m",{"v":1.365,"d":"1.37"},{"v":5.135,"d":"5.14"},{"v":54.999999999999986,"d":"55 m"},{"v":63.98724541316474,"d":"64 m"},"","pne > 35m"]
[13.1,121,"m",{"v":2.7509999999999994,"d":"2.75"},{"v":10.348999999999998,"d":"10.35"},{"v":120.99999999999997,"d":"121 m"},"Hyperoxie","Narcose",null,121,"m",{"v":1.3754999999999997,"d":"1.38"},{"v":5.174499999999999,"d":"5.17"},{"v":55.499999999999986,"d":"56 m"},{"v":64.55637807018908,"d":"65 m"},"","pne > 35m"]
[13.2,122,"m",{"v":2.772,"d":"2.77"},{"v":10.427999999999999,"d":"10.43"},{"v":121.99999999999997,"d":"122 m"},"Hyperoxie","Narcose",null,122,"m",{"v":1.386,"d":"1.39"},{"v":5.2139999999999995,"d":"5.21"},{"v":55.999999999999986,"d":"56 m"},{"v":65.12551072721342,"d":"65 m"},"","pne > 35m"]
[13.3,123,"m",{"v":2.793,"d":"2.79"},{"v":10.507,"d":"10.51"},{"v":122.99999999999997,"d":"123 m"},"Hyperoxie","Narcose",null,123,"m",{"v":1.3965,"d":"1.40"},{"v":5.2535,"d":"5.25"},{"v":56.499999999999986,"d":"57 m"},{"v":65.69464338423776,"d":"66 m"},"","pne > 35m"]
[13.4,124,"m",{"v":2.8140000000000005,"d":"2.81"},{"v":10.586000000000002,"d":"10.59"},{"v":124,"d":"124 m"},"Hyperoxie","Narcose",null,124,"m",{"v":1.4070000000000003,"d":"1.41"},{"v":5.293000000000001,"d":"5.29"},{"v":57,"d":"57 m"},{"v":66.2637760412621,"d":"66 m"},"","pne > 35m"]
[13.5,125,"m",{"v":2.835,"d":"2.84"},{"v":10.665,"d":"10.67"},{"v":124.99999999999997,"d":"125 m"},"Hyperoxie","Narcose",null,125,"m",{"v":1.4175,"d":"1.42"},{"v":5.3325,"d":"5.33"},{"v":57.499999999999986,"d":"58 m"},{"v":66.83290869828645,"d":"67 m"},"","pne > 35m"]
[13.6,126,"m",{"v":2.856,"d":"2.86"},{"v":10.743999999999998,"d":"10.74"},{"v":125.99999999999997,"d":"126 m"},"Hyperoxie","Narcose",null,126,"m",{"v":1.428,"d":"1.43"},{"v":5.371999999999999,"d":"5.37"},{"v":57.999999999999986,"d":"58 m"},{"v":67.40204135531079,"d":"67 m"},"","pne > 35m"]
[13.7,127,"m",{"v":2.877,"d":"2.88"},{"v":10.823,"d":"10.82"},{"v":127,"d":"127 m"},"Hyperoxie","Narcose",null,127,"m",{"v":1.4385,"d":"1.44"},{"v":5.4115,"d":"5.41"},{"v":58.5,"d":"59 m"},{"v":67.97117401233513,"d":"68 m"},"","pne > 35m"]
[13.8,128,"m",{"$f":"((B178/10)+1)*$N$31/100","v":{"v":2.898,"d":"2.90"}},{"$f":"((B178/10)+1)*$N$33/100","v":{"v":10.902000000000001,"d":"10.90"}},{"v":128,"d":"128 m"},"Hyperoxie","Narcose",null,128,"m",{"v":1.449,"d":"1.45"},{"v":5.4510000000000005,"d":"5.45"},{"v":59,"d":"59 m"},{"v":68.5403066693595,"d":"69 m"},"","pne > 35m"]
[13.9,129,"m",{"v":2.9190000000000005,"d":"2.92"},{"v":10.981000000000002,"d":"10.98"},{"$f":"IF(E179<0.79,0,(10*E179)/0.79-7.9/0.79)","v":{"v":129.00000000000003,"d":"129 m"}},{"$f":"IF(D179>1.47,\"Hyperoxie\",IF(D179<0.19,\"Hypoxie\",\"\"))","v":"Hyperoxie"},{"$f":"IF(E179>5.53,\"Narcose\",IF(E179>3.56,\"pne>35m\",\"\"))","v":"Narcose"},null,129,"m",{"$f":"((J179/10)+1)*$D$22/100","v":{"v":1.4595000000000002,"d":"1.46"}},{"$f":"((J179/10)+1)*$D$21/100","v":{"v":5.490500000000001,"d":"5.49"}},{"$f":"IF(M179<0.79,0,(10*M179)/0.79-7.9/0.79)","v":{"v":59.500000000000014,"d":"60 m"}},{"$f":"(((((($E$18%*1.428)+($F$18%*0.178)+($D$21%*1.25))*A179))/1.28738)*10)-10","v":{"v":69.10943932638384,"d":"69 m"}},{"$f":"IF(L179>1.47,\"Hyperoxie\",IF(L179<0.19,\"Hypoxie\",\"\"))","v":""},{"$f":"IF(M179>5.53,\"Narcose\",IF(M179>3.56,\"pne > 35m\",\"\"))","v":"pne > 35m"}]
[{"$f":"(B180/10)+1","v":14},130,"m",2.94,11.06,{"v":130,"d":"130 m"},"Hyperoxie","Narcose",null,130,"m",1.47,5.53,{"v":60,"d":"60 m"},{"v":69.67857198340818,"d":"70 m"},"","pne > 35m"]
[14.1,131,"m",{"v":2.961,"d":"2.96"},{"v":11.139,"d":"11.14"},{"v":130.99999999999997,"d":"131 m"},"Hyperoxie","Narcose",null,131,"m",{"v":1.4805,"d":"1.48"},{"v":5.5695,"d":"5.57"},{"v":60.499999999999986,"d":"61 m"},{"v":70.24770464043252,"d":"70 m"},"Hyperoxie","Narcose"]
[14.2,132,"m",{"v":2.9819999999999998,"d":"2.98"},{"v":11.218,"d":"11.22"},{"v":132,"d":"132 m"},"Hyperoxie","Narcose",null,132,"m",{"v":1.4909999999999999,"d":"1.49"},{"v":5.609,"d":"5.61"},{"v":61,"d":"61 m"},{"v":70.81683729745686,"d":"71 m"},"Hyperoxie","Narcose"]
[14.3,133,"m",{"v":3.003,"d":"3.00"},{"v":11.297,"d":"11.30"},{"v":133,"d":"133 m"},"Hyperoxie","Narcose",null,133,"m",{"v":1.5015,"d":"1.50"},{"v":5.6485,"d":"5.65"},{"v":61.5,"d":"62 m"},{"v":71.3859699544812,"d":"71 m"},"Hyperoxie","Narcose"]
[14.4,134,"m",{"v":3.0240000000000005,"d":"3.02"},{"v":11.376000000000001,"d":"11.38"},{"v":134.00000000000003,"d":"134 m"},"Hyperoxie","Narcose",null,134,"m",{"v":1.5120000000000002,"d":"1.51"},{"v":5.688000000000001,"d":"5.69"},{"v":62.000000000000014,"d":"62 m"},{"v":71.95510261150554,"d":"72 m"},"Hyperoxie","Narcose"]
[14.5,135,"m",{"v":3.045,"d":"3.05"},{"v":11.455,"d":"11.46"},{"v":135,"d":"135 m"},"Hyperoxie","Narcose",null,135,"m",{"v":1.5225,"d":"1.52"},{"v":5.7275,"d":"5.73"},{"v":62.5,"d":"63 m"},{"v":72.52423526852988,"d":"73 m"},"Hyperoxie","Narcose"]
[14.6,136,"m",{"v":3.066,"d":"3.07"},{"v":11.533999999999999,"d":"11.53"},{"v":135.99999999999997,"d":"136 m"},"Hyperoxie","Narcose",null,136,"m",{"v":1.533,"d":"1.53"},{"v":5.7669999999999995,"d":"5.77"},{"v":62.999999999999986,"d":"63 m"},{"v":73.09336792555422,"d":"73 m"},"Hyperoxie","Narcose"]
[14.7,137,"m",{"v":3.0869999999999997,"d":"3.09"},{"v":11.613,"d":"11.61"},{"v":137,"d":"137 m"},"Hyperoxie","Narcose",null,137,"m",{"v":1.5434999999999999,"d":"1.54"},{"v":5.8065,"d":"5.81"},{"v":63.5,"d":"64 m"},{"v":73.66250058257859,"d":"74 m"},"Hyperoxie","Narcose"]
[14.8,138,"m",{"v":3.108,"d":"3.11"},{"v":11.692,"d":"11.69"},{"v":138,"d":"138 m"},"Hyperoxie","Narcose",null,138,"m",{"v":1.554,"d":"1.55"},{"v":5.846,"d":"5.85"},{"v":64,"d":"64 m"},{"v":74.23163323960293,"d":"74 m"},"Hyperoxie","Narcose"]
[14.9,139,"m",{"v":3.1290000000000004,"d":"3.13"},{"v":11.771,"d":"11.77"},{"v":139,"d":"139 m"},"Hyperoxie","Narcose",null,139,"m",{"v":1.5645000000000002,"d":"1.56"},{"v":5.8855,"d":"5.89"},{"v":64.5,"d":"65 m"},{"v":74.80076589662728,"d":"75 m"},"Hyperoxie","Narcose"]
[15,140,"m",3.15,11.85,{"v":140,"d":"140 m"},"Hyperoxie","Narcose",null,140,"m",{"v":1.575,"d":"1.58"},{"v":5.925,"d":"5.93"},{"v":65,"d":"65 m"},{"v":75.36989855365162,"d":"75 m"},"Hyperoxie","Narcose"]
[15.1,141,"m",{"v":3.171,"d":"3.17"},{"v":11.928999999999998,"d":"11.93"},{"v":140.99999999999997,"d":"141 m"},"Hyperoxie","Narcose",null,141,"m",{"v":1.5855,"d":"1.59"},{"v":5.964499999999999,"d":"5.96"},{"v":65.49999999999999,"d":"66 m"},{"v":75.93903121067596,"d":"76 m"},"Hyperoxie","Narcose"]
[15.2,142,"m",{"v":3.1919999999999997,"d":"3.19"},{"v":12.008,"d":"12.01"},{"v":141.99999999999997,"d":"142 m"},"Hyperoxie","Narcose",null,142,"m",{"v":1.5959999999999999,"d":"1.60"},{"v":6.004,"d":"6.00"},{"v":65.99999999999999,"d":"66 m"},{"v":76.5081638677003,"d":"77 m"},"Hyperoxie","Narcose"]
[15.3,143,"m",{"v":3.213,"d":"3.21"},{"v":12.087,"d":"12.09"},{"v":143,"d":"143 m"},"Hyperoxie","Narcose",null,143,"m",{"v":1.6065,"d":"1.61"},{"v":6.0435,"d":"6.04"},{"v":66.5,"d":"67 m"},{"v":77.07729652472466,"d":"77 m"},"Hyperoxie","Narcose"]
[15.4,144,"m",{"v":3.2340000000000004,"d":"3.23"},{"v":12.166000000000002,"d":"12.17"},{"v":144.00000000000003,"d":"144 m"},"Hyperoxie","Narcose",null,144,"m",{"v":1.6170000000000002,"d":"1.62"},{"v":6.083000000000001,"d":"6.08"},{"v":67.00000000000001,"d":"67 m"},{"v":77.64642918174899,"d":"78 m"},"Hyperoxie","Narcose"]
[15.5,145,"m",{"v":3.255,"d":"3.26"},{"v":12.245,"d":"12.25"},{"v":144.99999999999997,"d":"145 m"},"Hyperoxie","Narcose",null,145,"m",{"v":1.6275,"d":"1.63"},{"v":6.1225,"d":"6.12"},{"v":67.49999999999999,"d":"68 m"},{"v":78.21556183877333,"d":"78 m"},"Hyperoxie","Narcose"]
[15.6,146,"m",{"v":3.276,"d":"3.28"},{"v":12.323999999999998,"d":"12.32"},{"v":145.99999999999997,"d":"146 m"},"Hyperoxie","Narcose",null,146,"m",{"v":1.638,"d":"1.64"},{"v":6.161999999999999,"d":"6.16"},{"v":67.99999999999999,"d":"68 m"},{"v":78.78469449579767,"d":"79 m"},"Hyperoxie","Narcose"]
[15.7,147,"m",{"v":3.2969999999999997,"d":"3.30"},{"v":12.402999999999999,"d":"12.40"},{"v":146.99999999999997,"d":"147 m"},"Hyperoxie","Narcose",null,147,"m",{"v":1.6484999999999999,"d":"1.65"},{"v":6.201499999999999,"d":"6.20"},{"v":68.49999999999999,"d":"69 m"},{"v":79.353827152822,"d":"79 m"},"Hyperoxie","Narcose"]
[15.8,148,"m",{"v":3.318,"d":"3.32"},{"v":12.482000000000001,"d":"12.48"},{"v":148,"d":"148 m"},"Hyperoxie","Narcose",null,148,"m",{"v":1.659,"d":"1.66"},{"v":6.2410000000000005,"d":"6.24"},{"v":69,"d":"69 m"},{"v":79.92295980984636,"d":"80 m"},"Hyperoxie","Narcose"]
[15.9,149,"m",{"v":3.3390000000000004,"d":"3.34"},{"v":12.561000000000002,"d":"12.56"},{"v":149,"d":"149 m"},"Hyperoxie","Narcose",null,149,"m",{"v":1.6695000000000002,"d":"1.67"},{"v":6.280500000000001,"d":"6.28"},{"v":69.5,"d":"70 m"},{"v":80.4920924668707,"d":"80 m"},"Hyperoxie","Narcose"]
[16,150,"m",3.36,12.64,{"v":150,"d":"150 m"},"Hyperoxie","Narcose",null,150,"m",1.68,6.32,{"v":70,"d":"70 m"},{"v":81.06122512389506,"d":"81 m"},"Hyperoxie","Narcose"]
[16.1,151,"m",{"v":3.3810000000000002,"d":"3.38"},{"v":12.719000000000001,"d":"12.72"},{"v":151,"d":"151 m"},"Hyperoxie","Narcose",null,151,"m",{"v":1.6905000000000001,"d":"1.69"},{"v":6.359500000000001,"d":"6.36"},{"v":70.5,"d":"71 m"},{"v":81.6303577809194,"d":"82 m"},"Hyperoxie","Narcose"]
[16.2,152,"m",{"v":3.4019999999999997,"d":"3.40"},{"v":12.798,"d":"12.80"},{"v":152,"d":"152 m"},"Hyperoxie","Narcose",null,152,"m",{"v":1.7009999999999998,"d":"1.70"},{"v":6.399,"d":"6.40"},{"v":71,"d":"71 m"},{"v":82.19949043794374,"d":"82 m"},"Hyperoxie","Narcose"]
[16.3,153,"m",{"v":3.423,"d":"3.42"},{"v":12.877,"d":"12.88"},{"v":153,"d":"153 m"},"Hyperoxie","Narcose",null,153,"m",{"v":1.7115,"d":"1.71"},{"v":6.4385,"d":"6.44"},{"v":71.5,"d":"72 m"},{"v":82.76862309496809,"d":"83 m"},"Hyperoxie","Narcose"]
[16.4,154,"m",{"v":3.444,"d":"3.44"},{"v":12.956,"d":"12.96"},{"v":154,"d":"154 m"},"Hyperoxie","Narcose",null,154,"m",{"v":1.722,"d":"1.72"},{"v":6.478,"d":"6.48"},{"v":72,"d":"72 m"},{"v":83.33775575199242,"d":"83 m"},"Hyperoxie","Narcose"]
[16.5,155,"m",{"v":3.465,"d":"3.47"},{"v":13.035,"d":"13.04"},{"v":154.99999999999997,"d":"155 m"},"Hyperoxie","Narcose",null,155,"m",{"v":1.7325,"d":"1.73"},{"v":6.5175,"d":"6.52"},{"v":72.49999999999999,"d":"73 m"},{"v":83.90688840901677,"d":"84 m"},"Hyperoxie","Narcose"]
[16.6,156,"m",{"v":3.486,"d":"3.49"},{"v":13.114,"d":"13.11"},{"v":156,"d":"156 m"},"Hyperoxie","Narcose",null,156,"m",{"v":1.743,"d":"1.74"},{"v":6.557,"d":"6.56"},{"v":73,"d":"73 m"},{"v":84.47602106604111,"d":"84 m"},"Hyperoxie","Narcose"]
[16.7,157,"m",{"v":3.5069999999999997,"d":"3.51"},{"v":13.193,"d":"13.19"},{"v":157,"d":"157 m"},"Hyperoxie","Narcose",null,157,"m",{"v":1.7534999999999998,"d":"1.75"},{"v":6.5965,"d":"6.60"},{"v":73.5,"d":"74 m"},{"v":85.04515372306544,"d":"85 m"},"Hyperoxie","Narcose"]
[16.8,158,"m",{"v":3.528,"d":"3.53"},{"v":13.272,"d":"13.27"},{"v":158,"d":"158 m"},"Hyperoxie","Narcose",null,158,"m",{"v":1.764,"d":"1.76"},{"v":6.636,"d":"6.64"},{"v":74,"d":"74 m"},{"v":85.6142863800898,"d":"86 m"},"Hyperoxie","Narcose"]
[16.9,159,"m",{"v":3.549,"d":"3.55"},{"v":13.350999999999999,"d":"13.35"},{"v":158.99999999999997,"d":"159 m"},"Hyperoxie","Narcose",null,159,"m",{"v":1.7745,"d":"1.77"},{"v":6.6754999999999995,"d":"6.68"},{"v":74.49999999999999,"d":"75 m"},{"v":86.18341903711413,"d":"86 m"},"Hyperoxie","Narcose"]
[17,160,"m",3.57,13.43,{"v":160,"d":"160 m"},"Hyperoxie","Narcose",null,160,"m",{"v":1.785,"d":"1.79"},{"v":6.715,"d":"6.72"},{"v":75,"d":"75 m"},{"v":86.7525516941385,"d":"87 m"},"Hyperoxie","Narcose"]
[17.1,161,"m",{"v":3.591,"d":"3.59"},{"v":13.509,"d":"13.51"},{"v":161,"d":"161 m"},"Hyperoxie","Narcose",null,161,"m",{"v":1.7955,"d":"1.80"},{"v":6.7545,"d":"6.75"},{"v":75.5,"d":"76 m"},{"v":87.32168435116284,"d":"87 m"},"Hyperoxie","Narcose"]
[17.2,162,"m",{"v":3.612,"d":"3.61"},{"v":13.588,"d":"13.59"},{"v":162,"d":"162 m"},"Hyperoxie","Narcose",null,162,"m",{"v":1.806,"d":"1.81"},{"v":6.794,"d":"6.79"},{"v":76,"d":"76 m"},{"v":87.89081700818718,"d":"88 m"},"Hyperoxie","Narcose"]
[17.3,163,"m",{"v":3.633,"d":"3.63"},{"v":13.667,"d":"13.67"},{"v":162.99999999999997,"d":"163 m"},"Hyperoxie","Narcose",null,163,"m",{"v":1.8165,"d":"1.82"},{"v":6.8335,"d":"6.83"},{"v":76.49999999999999,"d":"77 m"},{"v":88.45994966521154,"d":"88 m"},"Hyperoxie","Narcose"]
[17.4,164,"m",{"v":3.654,"d":"3.65"},{"v":13.745999999999999,"d":"13.75"},{"v":163.99999999999997,"d":"164 m"},"Hyperoxie","Narcose",null,164,"m",{"v":1.827,"d":"1.83"},{"v":6.872999999999999,"d":"6.87"},{"v":76.99999999999999,"d":"77 m"},{"v":89.02908232223587,"d":"89 m"},"Hyperoxie","Narcose"]
[17.5,165,"m",{"v":3.675,"d":"3.68"},{"v":13.825,"d":"13.83"},{"v":165,"d":"165 m"},"Hyperoxie","Narcose",null,165,"m",{"v":1.8375,"d":"1.84"},{"v":6.9125,"d":"6.91"},{"v":77.5,"d":"78 m"},{"v":89.59821497926022,"d":"90 m"},"Hyperoxie","Narcose"]
[17.6,166,"m",{"v":3.696,"d":"3.70"},{"v":13.904000000000002,"d":"13.90"},{"v":166.00000000000003,"d":"166 m"},"Hyperoxie","Narcose",null,166,"m",{"v":1.848,"d":"1.85"},{"v":6.952000000000001,"d":"6.95"},{"v":78.00000000000001,"d":"78 m"},{"v":90.16734763628456,"d":"90 m"},"Hyperoxie","Narcose"]
[17.7,167,"m",{"v":3.717,"d":"3.72"},{"v":13.982999999999999,"d":"13.98"},{"v":166.99999999999997,"d":"167 m"},"Hyperoxie","Narcose",null,167,"m",{"v":1.8585,"d":"1.86"},{"v":6.991499999999999,"d":"6.99"},{"v":78.49999999999999,"d":"79 m"},{"v":90.7364802933089,"d":"91 m"},"Hyperoxie","Narcose"]
[17.8,168,"m",{"v":3.738,"d":"3.74"},{"v":14.062000000000001,"d":"14.06"},{"v":168,"d":"168 m"},"Hyperoxie","Narcose",null,168,"m",{"v":1.869,"d":"1.87"},{"v":7.031000000000001,"d":"7.03"},{"v":79,"d":"79 m"},{"v":91.30561295033324,"d":"91 m"},"Hyperoxie","Narcose"]
[17.9,169,"m",{"v":3.759,"d":"3.76"},{"v":14.140999999999998,"d":"14.14"},{"v":168.99999999999994,"d":"169 m"},"Hyperoxie","Narcose",null,169,"m",{"v":1.8795,"d":"1.88"},{"v":7.070499999999999,"d":"7.07"},{"v":79.49999999999997,"d":"80 m"},{"v":91.87474560735758,"d":"92 m"},"Hyperoxie","Narcose"]
[18,170,"m",3.78,14.22,{"v":170,"d":"170 m"},"Hyperoxie","Narcose",null,170,"m",1.89,7.11,{"v":80,"d":"80 m"},{"v":92.44387826438192,"d":"92 m"},"Hyperoxie","Narcose"]
[18.1,171,"m",{"v":3.801,"d":"3.80"},{"v":14.299000000000001,"d":"14.30"},{"v":171,"d":"171 m"},"Hyperoxie","Narcose",null,171,"m",{"v":1.9005,"d":"1.90"},{"v":7.149500000000001,"d":"7.15"},{"v":80.5,"d":"81 m"},{"v":93.01301092140628,"d":"93 m"},"Hyperoxie","Narcose"]
[18.2,172,"m",{"v":3.822,"d":"3.82"},{"v":14.378,"d":"14.38"},{"v":172,"d":"172 m"},"Hyperoxie","Narcose",null,172,"m",{"v":1.911,"d":"1.91"},{"v":7.189,"d":"7.19"},{"v":81,"d":"81 m"},{"v":93.58214357843062,"d":"94 m"},"Hyperoxie","Narcose"]
[18.3,173,"m",{"v":3.843,"d":"3.84"},{"v":14.457,"d":"14.46"},{"v":172.99999999999997,"d":"173 m"},"Hyperoxie","Narcose",null,173,"m",{"v":1.9215,"d":"1.92"},{"v":7.2285,"d":"7.23"},{"v":81.49999999999999,"d":"82 m"},{"v":94.15127623545499,"d":"94 m"},"Hyperoxie","Narcose"]
[18.4,174,"m",{"v":3.864,"d":"3.86"},{"v":14.536,"d":"14.54"},{"v":173.99999999999997,"d":"174 m"},"Hyperoxie","Narcose",null,174,"m",{"v":1.932,"d":"1.93"},{"v":7.268,"d":"7.27"},{"v":81.99999999999999,"d":"82 m"},{"v":94.7204088924793,"d":"95 m"},"Hyperoxie","Narcose"]
[18.5,175,"m",{"v":3.885,"d":"3.89"},{"v":14.615,"d":"14.62"},{"v":175,"d":"175 m"},"Hyperoxie","Narcose",null,175,"m",{"v":1.9425,"d":"1.94"},{"v":7.3075,"d":"7.31"},{"v":82.5,"d":"83 m"},{"v":95.28954154950367,"d":"95 m"},"Hyperoxie","Narcose"]
[18.6,176,"m",{"v":3.906,"d":"3.91"},{"v":14.694,"d":"14.69"},{"v":176,"d":"176 m"},"Hyperoxie","Narcose",null,176,"m",{"v":1.953,"d":"1.95"},{"v":7.347,"d":"7.35"},{"v":83,"d":"83 m"},{"v":95.85867420652802,"d":"96 m"},"Hyperoxie","Narcose"]
[18.7,177,"m",{"v":3.927,"d":"3.93"},{"v":14.773,"d":"14.77"},{"v":176.99999999999997,"d":"177 m"},"Hyperoxie","Narcose",null,177,"m",{"v":1.9635,"d":"1.96"},{"v":7.3865,"d":"7.39"},{"v":83.49999999999999,"d":"84 m"},{"v":96.42780686355235,"d":"96 m"},"Hyperoxie","Narcose"]
[18.8,178,"m",{"v":3.948,"d":"3.95"},{"v":14.852,"d":"14.85"},{"v":178,"d":"178 m"},"Hyperoxie","Narcose",null,178,"m",{"v":1.974,"d":"1.97"},{"v":7.426,"d":"7.43"},{"v":84,"d":"84 m"},{"v":96.99693952057669,"d":"97 m"},"Hyperoxie","Narcose"]
[18.9,179,"m",{"v":3.969,"d":"3.97"},{"v":14.931,"d":"14.93"},{"v":179,"d":"179 m"},"Hyperoxie","Narcose",null,179,"m",{"v":1.9845,"d":"1.98"},{"v":7.4655,"d":"7.47"},{"v":84.5,"d":"85 m"},{"v":97.56607217760103,"d":"98 m"},"Hyperoxie","Narcose"]
[19,180,"m",3.99,15.01,{"v":179.99999999999997,"d":"180 m"},"Hyperoxie","Narcose",null,180,"m",{"v":1.995,"d":"2.00"},{"v":7.505,"d":"7.51"},{"v":84.99999999999999,"d":"85 m"},{"v":98.13520483462537,"d":"98 m"},"Hyperoxie","Narcose"]
[19.1,181,"m",{"v":4.011,"d":"4.01"},{"v":15.089,"d":"15.09"},{"v":181,"d":"181 m"},"Hyperoxie","Narcose",null,181,"m",{"v":2.0055,"d":"2.01"},{"v":7.5445,"d":"7.54"},{"v":85.5,"d":"86 m"},{"v":98.70433749164972,"d":"99 m"},"Hyperoxie","Narcose"]
[19.2,182,"m",{"v":4.032,"d":"4.03"},{"v":15.168,"d":"15.17"},{"v":182,"d":"182 m"},"Hyperoxie","Narcose",null,182,"m",{"v":2.016,"d":"2.02"},{"v":7.584,"d":"7.58"},{"v":86,"d":"86 m"},{"v":99.27347014867406,"d":"99 m"},"Hyperoxie","Narcose"]
[19.3,183,"m",{"v":4.053,"d":"4.05"},{"v":15.247,"d":"15.25"},{"v":183,"d":"183 m"},"Hyperoxie","Narcose",null,183,"m",{"v":2.0265,"d":"2.03"},{"v":7.6235,"d":"7.62"},{"v":86.5,"d":"87 m"},{"v":99.84260280569842,"d":"100 m"},"Hyperoxie","Narcose"]
[19.4,184,"m",{"v":4.074,"d":"4.07"},{"v":15.325999999999999,"d":"15.33"},{"v":183.99999999999997,"d":"184 m"},"Hyperoxie","Narcose",null,184,"m",{"v":2.037,"d":"2.04"},{"v":7.662999999999999,"d":"7.66"},{"v":86.99999999999999,"d":"87 m"},{"v":100.41173546272275,"d":"100 m"},"Hyperoxie","Narcose"]
[19.5,185,"m",{"v":4.095,"d":"4.10"},{"v":15.405,"d":"15.41"},{"v":184.99999999999997,"d":"185 m"},"Hyperoxie","Narcose",null,185,"m",{"v":2.0475,"d":"2.05"},{"v":7.7025,"d":"7.70"},{"v":87.49999999999999,"d":"88 m"},{"v":100.9808681197471,"d":"101 m"},"Hyperoxie","Narcose"]
[19.6,186,"m",{"v":4.1160000000000005,"d":"4.12"},{"v":15.484000000000002,"d":"15.48"},{"v":186.00000000000003,"d":"186 m"},"Hyperoxie","Narcose",null,186,"m",{"v":2.0580000000000003,"d":"2.06"},{"v":7.742000000000001,"d":"7.74"},{"v":88.00000000000001,"d":"88 m"},{"v":101.55000077677145,"d":"102 m"},"Hyperoxie","Narcose"]
[19.7,187,"m",{"v":4.137,"d":"4.14"},{"v":15.562999999999999,"d":"15.56"},{"v":186.99999999999997,"d":"187 m"},"Hyperoxie","Narcose",null,187,"m",{"v":2.0685,"d":"2.07"},{"v":7.781499999999999,"d":"7.78"},{"v":88.49999999999999,"d":"89 m"},{"v":102.11913343379578,"d":"102 m"},"Hyperoxie","Narcose"]
[19.8,188,"m",{"v":4.158,"d":"4.16"},{"v":15.642000000000001,"d":"15.64"},{"v":188,"d":"188 m"},"Hyperoxie","Narcose",null,188,"m",{"v":2.079,"d":"2.08"},{"v":7.821000000000001,"d":"7.82"},{"v":89,"d":"89 m"},{"v":102.68826609082014,"d":"103 m"},"Hyperoxie","Narcose"]
[19.9,189,"m",{"v":4.178999999999999,"d":"4.18"},{"v":15.720999999999998,"d":"15.72"},{"v":188.99999999999997,"d":"189 m"},"Hyperoxie","Narcose",null,189,"m",{"v":2.0894999999999997,"d":"2.09"},{"v":7.860499999999999,"d":"7.86"},{"v":89.49999999999999,"d":"90 m"},{"v":103.25739874784446,"d":"103 m"},"Hyperoxie","Narcose"]
[20,190,"m",{"v":4.2,"d":"4.20"},{"v":15.8,"d":"15.80"},{"v":190,"d":"190 m"},"Hyperoxie","Narcose",null,190,"m",{"v":2.1,"d":"2.10"},{"v":7.9,"d":"7.90"},{"v":90,"d":"90 m"},{"v":103.8265314048688,"d":"104 m"},"Hyperoxie","Narcose"]
[20.1,191,"m",{"v":4.221,"d":"4.22"},{"v":15.879000000000001,"d":"15.88"},{"v":191.00000000000003,"d":"191 m"},"Hyperoxie","Narcose",null,191,"m",{"v":2.1105,"d":"2.11"},{"v":7.939500000000001,"d":"7.94"},{"v":90.50000000000001,"d":"91 m"},{"v":104.39566406189316,"d":"104 m"},"Hyperoxie","Narcose"]
[20.2,192,"m",{"$f":"((B242/10)+1)*$N$31/100","v":{"v":4.242,"d":"4.24"}},{"$f":"((B242/10)+1)*$N$33/100","v":{"v":15.958,"d":"15.96"}},{"v":192,"d":"192 m"},"Hyperoxie","Narcose",null,192,"m",{"v":2.121,"d":"2.12"},{"v":7.979,"d":"7.98"},{"v":91,"d":"91 m"},{"v":104.9647967189175,"d":"105 m"},"Hyperoxie","Narcose"]
[20.3,193,"m",{"v":4.263,"d":"4.26"},{"v":16.037,"d":"16.04"},{"$f":"IF(E243<0.79,0,(10*E243)/0.79-7.9/0.79)","v":{"v":193,"d":"193 m"}},{"$f":"IF(D243>1.47,\"Hyperoxie\",IF(D243<0.19,\"Hypoxie\",\"\"))","v":"Hyperoxie"},{"$f":"IF(E243>5.53,\"Narcose\",IF(E243>3.56,\"pne>35m\",\"\"))","v":"Narcose"},null,193,"m",{"$f":"((J243/10)+1)*$D$22/100","v":{"v":2.1315,"d":"2.13"}},{"$f":"((J243/10)+1)*$D$21/100","v":{"v":8.0185,"d":"8.02"}},{"$f":"IF(M243<0.79,0,(10*M243)/0.79-7.9/0.79)","v":{"v":91.5,"d":"92 m"}},{"$f":"(((((($E$18%*1.428)+($F$18%*0.178)+($D$21%*1.25))*A243))/1.28738)*10)-10","v":{"v":105.53392937594184,"d":"106 m"}},{"$f":"IF(L243>1.47,\"Hyperoxie\",IF(L243<0.19,\"Hypoxie\",\"\"))","v":"Hyperoxie"},{"$f":"IF(M243>5.53,\"Narcose\",IF(M243>3.56,\"pne > 35m\",\"\"))","v":"Narcose"}]
[{"$f":"(B244/10)+1","v":20.4},194,"m",{"v":4.284,"d":"4.28"},{"v":16.116,"d":"16.12"},{"v":194,"d":"194 m"},"Hyperoxie","Narcose",null,194,"m",{"v":2.142,"d":"2.14"},{"v":8.058,"d":"8.06"},{"v":92,"d":"92 m"},{"v":106.10306203296618,"d":"106 m"},"Hyperoxie","Narcose"]
[20.5,195,"m",{"v":4.305,"d":"4.31"},{"v":16.195,"d":"16.20"},{"v":194.99999999999997,"d":"195 m"},"Hyperoxie","Narcose",null,195,"m",{"v":2.1525,"d":"2.15"},{"v":8.0975,"d":"8.10"},{"v":92.49999999999999,"d":"93 m"},{"v":106.67219468999053,"d":"107 m"},"Hyperoxie","Narcose"]
[20.6,196,"m",{"v":4.3260000000000005,"d":"4.33"},{"v":16.274,"d":"16.27"},{"v":196,"d":"196 m"},"Hyperoxie","Narcose",null,196,"m",{"v":2.1630000000000003,"d":"2.16"},{"v":8.137,"d":"8.14"},{"v":93,"d":"93 m"},{"v":107.2413273470149,"d":"107 m"},"Hyperoxie","Narcose"]
[20.7,197,"m",{"v":4.3469999999999995,"d":"4.35"},{"v":16.352999999999998,"d":"16.35"},{"v":196.99999999999994,"d":"197 m"},"Hyperoxie","Narcose",null,197,"m",{"v":2.1734999999999998,"d":"2.17"},{"v":8.176499999999999,"d":"8.18"},{"v":93.49999999999997,"d":"94 m"},{"v":107.81046000403921,"d":"108 m"},"Hyperoxie","Narcose"]
[20.8,198,"m",{"v":4.368,"d":"4.37"},{"v":16.432000000000002,"d":"16.43"},{"v":198.00000000000003,"d":"198 m"},"Hyperoxie","Narcose",null,198,"m",{"v":2.184,"d":"2.18"},{"v":8.216000000000001,"d":"8.22"},{"v":94.00000000000001,"d":"94 m"},{"v":108.37959266106358,"d":"108 m"},"Hyperoxie","Narcose"]
[20.9,199,"m",{"v":4.388999999999999,"d":"4.39"},{"v":16.511,"d":"16.51"},{"v":198.99999999999997,"d":"199 m"},"Hyperoxie","Narcose",null,199,"m",{"v":2.1944999999999997,"d":"2.19"},{"v":8.2555,"d":"8.26"},{"v":94.49999999999999,"d":"95 m"},{"v":108.9487253180879,"d":"109 m"},"Hyperoxie","Narcose"]
[21,200,"m",4.41,16.59,{"v":200,"d":"200 m"},"Hyperoxie","Narcose",null,200,"m",{"v":2.205,"d":"2.21"},{"v":8.295,"d":"8.30"},{"v":95,"d":"95 m"},{"v":109.51785797511226,"d":"110 m"},"Hyperoxie","Narcose"]
[21.1,201,"m",{"v":4.431,"d":"4.43"},{"v":16.669,"d":"16.67"},{"v":201,"d":"201 m"},"Hyperoxie","Narcose",null,201,"m",{"v":2.2155,"d":"2.22"},{"v":8.3345,"d":"8.33"},{"v":95.5,"d":"96 m"},{"v":110.0869906321366,"d":"110 m"},"Hyperoxie","Narcose"]
[21.2,202,"m",{"v":4.452,"d":"4.45"},{"v":16.748,"d":"16.75"},{"v":202,"d":"202 m"},"Hyperoxie","Narcose",null,202,"m",{"v":2.226,"d":"2.23"},{"v":8.374,"d":"8.37"},{"v":96,"d":"96 m"},{"v":110.65612328916094,"d":"111 m"},"Hyperoxie","Narcose"]
[21.3,203,"m",{"v":4.473,"d":"4.47"},{"v":16.827,"d":"16.83"},{"v":203,"d":"203 m"},"Hyperoxie","Narcose",null,203,"m",{"v":2.2365,"d":"2.24"},{"v":8.4135,"d":"8.41"},{"v":96.5,"d":"97 m"},{"v":111.22525594618529,"d":"111 m"},"Hyperoxie","Narcose"]
[21.4,204,"m",{"v":4.494,"d":"4.49"},{"v":16.906,"d":"16.91"},{"v":204,"d":"204 m"},"Hyperoxie","Narcose",null,204,"m",{"v":2.247,"d":"2.25"},{"v":8.453,"d":"8.45"},{"v":97,"d":"97 m"},{"v":111.79438860320963,"d":"112 m"},"Hyperoxie","Narcose"]
[21.5,205,"m",{"v":4.515,"d":"4.52"},{"v":16.985,"d":"16.99"},{"v":204.99999999999997,"d":"205 m"},"Hyperoxie","Narcose",null,205,"m",{"v":2.2575,"d":"2.26"},{"v":8.4925,"d":"8.49"},{"v":97.49999999999999,"d":"98 m"},{"v":112.36352126023398,"d":"112 m"},"Hyperoxie","Narcose"]
[21.6,206,"m",{"v":4.5360000000000005,"d":"4.54"},{"v":17.064,"d":"17.06"},{"v":205.99999999999997,"d":"206 m"},"Hyperoxie","Narcose",null,206,"m",{"v":2.2680000000000002,"d":"2.27"},{"v":8.532,"d":"8.53"},{"v":97.99999999999999,"d":"98 m"},{"v":112.93265391725834,"d":"113 m"},"Hyperoxie","Narcose"]
[21.7,207,"m",{"v":4.5569999999999995,"d":"4.56"},{"v":17.143,"d":"17.14"},{"v":207,"d":"207 m"},"Hyperoxie","Narcose",null,207,"m",{"v":2.2784999999999997,"d":"2.28"},{"v":8.5715,"d":"8.57"},{"v":98.5,"d":"99 m"},{"v":113.50178657428266,"d":"114 m"},"Hyperoxie","Narcose"]
[21.8,208,"m",{"v":4.578,"d":"4.58"},{"v":17.222,"d":"17.22"},{"v":208.00000000000003,"d":"208 m"},"Hyperoxie","Narcose",null,208,"m",{"v":2.289,"d":"2.29"},{"v":8.611,"d":"8.61"},{"v":99.00000000000001,"d":"99 m"},{"v":114.07091923130702,"d":"114 m"},"Hyperoxie","Narcose"]
[21.9,209,"m",{"v":4.599,"d":"4.60"},{"v":17.301,"d":"17.30"},{"v":208.99999999999997,"d":"209 m"},"Hyperoxie","Narcose",null,209,"m",{"v":2.2995,"d":"2.30"},{"v":8.6505,"d":"8.65"},{"v":99.49999999999999,"d":"100 m"},{"v":114.64005188833134,"d":"115 m"},"Hyperoxie","Narcose"]
[22,210,"m",4.62,17.38,{"v":209.99999999999997,"d":"210 m"},"Hyperoxie","Narcose",null,210,"m",2.31,8.69,{"v":99.99999999999999,"d":"100 m"},{"v":115.20918454535568,"d":"115 m"},"Hyperoxie","Narcose"]
[22.1,211,"m",{"v":4.641,"d":"4.64"},{"v":17.459,"d":"17.46"},{"v":211,"d":"211 m"},"Hyperoxie","Narcose",null,211,"m",{"v":2.3205,"d":"2.32"},{"v":8.7295,"d":"8.73"},{"v":100.5,"d":"101 m"},{"v":115.77831720238007,"d":"116 m"},"Hyperoxie","Narcose"]
[22.2,212,"m",{"v":4.662,"d":"4.66"},{"v":17.538,"d":"17.54"},{"v":211.99999999999997,"d":"212 m"},"Hyperoxie","Narcose",null,212,"m",{"v":2.331,"d":"2.33"},{"v":8.769,"d":"8.77"},{"v":100.99999999999999,"d":"101 m"},{"v":116.34744985940436,"d":"116 m"},"Hyperoxie","Narcose"]
[22.3,213,"m",{"v":4.683,"d":"4.68"},{"v":17.617,"d":"17.62"},{"v":213,"d":"213 m"},"Hyperoxie","Narcose",null,213,"m",{"v":2.3415,"d":"2.34"},{"v":8.8085,"d":"8.81"},{"v":101.5,"d":"102 m"},{"v":116.91658251642875,"d":"117 m"},"Hyperoxie","Narcose"]
[22.4,214,"m",{"v":4.704,"d":"4.70"},{"v":17.695999999999998,"d":"17.70"},{"v":213.99999999999997,"d":"214 m"},"Hyperoxie","Narcose",null,214,"m",{"v":2.352,"d":"2.35"},{"v":8.847999999999999,"d":"8.85"},{"v":101.99999999999999,"d":"102 m"},{"v":117.48571517345306,"d":"117 m"},"Hyperoxie","Narcose"]
[22.5,215,"m",{"v":4.725,"d":"4.73"},{"v":17.775,"d":"17.78"},{"v":215,"d":"215 m"},"Hyperoxie","Narcose",null,215,"m",{"v":2.3625,"d":"2.36"},{"v":8.8875,"d":"8.89"},{"v":102.5,"d":"103 m"},{"v":118.05484783047743,"d":"118 m"},"Hyperoxie","Narcose"]
[22.6,216,"m",{"v":4.746,"d":"4.75"},{"v":17.854,"d":"17.85"},{"v":215.99999999999997,"d":"216 m"},"Hyperoxie","Narcose",null,216,"m",{"v":2.373,"d":"2.37"},{"v":8.927,"d":"8.93"},{"v":102.99999999999999,"d":"103 m"},{"v":118.62398048750177,"d":"119 m"},"Hyperoxie","Narcose"]
[22.7,217,"m",{"v":4.7669999999999995,"d":"4.77"},{"v":17.933,"d":"17.93"},{"v":216.99999999999997,"d":"217 m"},"Hyperoxie","Narcose",null,217,"m",{"v":2.3834999999999997,"d":"2.38"},{"v":8.9665,"d":"8.97"},{"v":103.49999999999999,"d":"104 m"},{"v":119.19311314452611,"d":"119 m"},"Hyperoxie","Narcose"]
[22.8,218,"m",{"v":4.788,"d":"4.79"},{"v":18.012,"d":"18.01"},{"v":218,"d":"218 m"},"Hyperoxie","Narcose",null,218,"m",{"v":2.394,"d":"2.39"},{"v":9.006,"d":"9.01"},{"v":104,"d":"104 m"},{"v":119.76224580155045,"d":"120 m"},"Hyperoxie","Narcose"]
[22.9,219,"m",{"v":4.809,"d":"4.81"},{"v":18.090999999999998,"d":"18.09"},{"v":218.99999999999994,"d":"219 m"},"Hyperoxie","Narcose",null,219,"m",{"v":2.4045,"d":"2.40"},{"v":9.045499999999999,"d":"9.05"},{"v":104.49999999999997,"d":"105 m"},{"v":120.33137845857479,"d":"120 m"},"Hyperoxie","Narcose"]
[23,220,"m",4.83,18.17,{"v":220,"d":"220 m"},"Hyperoxie","Narcose",null,220,"m",{"v":2.415,"d":"2.42"},{"v":9.085,"d":"9.09"},{"v":105,"d":"105 m"},{"v":120.90051111559913,"d":"121 m"},"Hyperoxie","Narcose"]
[23.1,221,"m",{"v":4.851,"d":"4.85"},{"v":18.249000000000002,"d":"18.25"},{"v":221,"d":"221 m"},"Hyperoxie","Narcose",null,221,"m",{"v":2.4255,"d":"2.43"},{"v":9.124500000000001,"d":"9.12"},{"v":105.5,"d":"106 m"},{"v":121.46964377262347,"d":"121 m"},"Hyperoxie","Narcose"]
[23.2,222,"m",{"v":4.872,"d":"4.87"},{"v":18.328,"d":"18.33"},{"v":222,"d":"222 m"},"Hyperoxie","Narcose",null,222,"m",{"v":2.436,"d":"2.44"},{"v":9.164,"d":"9.16"},{"v":106,"d":"106 m"},{"v":122.03877642964781,"d":"122 m"},"Hyperoxie","Narcose"]
[23.3,223,"m",{"v":4.893,"d":"4.89"},{"v":18.407,"d":"18.41"},{"v":222.99999999999997,"d":"223 m"},"Hyperoxie","Narcose",null,223,"m",{"v":2.4465,"d":"2.45"},{"v":9.2035,"d":"9.20"},{"v":106.49999999999999,"d":"107 m"},{"v":122.60790908667215,"d":"123 m"},"Hyperoxie","Narcose"]
[23.4,224,"m",{"v":4.914,"d":"4.91"},{"v":18.486,"d":"18.49"},{"v":224,"d":"224 m"},"Hyperoxie","Narcose",null,224,"m",{"v":2.457,"d":"2.46"},{"v":9.243,"d":"9.24"},{"v":107,"d":"107 m"},{"v":123.17704174369649,"d":"123 m"},"Hyperoxie","Narcose"]
[23.5,225,"m",{"v":4.935,"d":"4.94"},{"v":18.565,"d":"18.57"},{"v":225,"d":"225 m"},"Hyperoxie","Narcose",null,225,"m",{"v":2.4675,"d":"2.47"},{"v":9.2825,"d":"9.28"},{"v":107.5,"d":"108 m"},{"v":123.74617440072086,"d":"124 m"},"Hyperoxie","Narcose"]
[23.6,226,"m",{"v":4.956,"d":"4.96"},{"v":18.644000000000002,"d":"18.64"},{"v":226.00000000000003,"d":"226 m"},"Hyperoxie","Narcose",null,226,"m",{"v":2.478,"d":"2.48"},{"v":9.322000000000001,"d":"9.32"},{"v":108.00000000000001,"d":"108 m"},{"v":124.31530705774523,"d":"124 m"},"Hyperoxie","Narcose"]
[23.7,227,"m",{"v":4.977,"d":"4.98"},{"v":18.723,"d":"18.72"},{"v":226.99999999999997,"d":"227 m"},"Hyperoxie","Narcose",null,227,"m",{"v":2.4885,"d":"2.49"},{"v":9.3615,"d":"9.36"},{"v":108.49999999999999,"d":"109 m"},{"v":124.88443971476954,"d":"125 m"},"Hyperoxie","Narcose"]
[23.8,228,"m",{"v":4.998,"d":"5.00"},{"v":18.802,"d":"18.80"},{"v":227.99999999999997,"d":"228 m"},"Hyperoxie","Narcose",null,228,"m",{"v":2.499,"d":"2.50"},{"v":9.401,"d":"9.40"},{"v":108.99999999999999,"d":"109 m"},{"v":125.45357237179391,"d":"125 m"},"Hyperoxie","Narcose"]
[23.9,229,"m",{"v":5.019,"d":"5.02"},{"v":18.881,"d":"18.88"},{"v":229,"d":"229 m"},"Hyperoxie","Narcose",null,229,"m",{"v":2.5095,"d":"2.51"},{"v":9.4405,"d":"9.44"},{"v":109.5,"d":"110 m"},{"v":126.02270502881822,"d":"126 m"},"Hyperoxie","Narcose"]
[24,230,"m",5.04,18.96,{"v":230.00000000000003,"d":"230 m"},"Hyperoxie","Narcose",null,230,"m",2.52,9.48,{"v":110.00000000000001,"d":"110 m"},{"v":126.59183768584259,"d":"127 m"},"Hyperoxie","Narcose"]
[24.1,231,"m",{"v":5.061,"d":"5.06"},{"v":19.039,"d":"19.04"},{"v":231,"d":"231 m"},"Hyperoxie","Narcose",null,231,"m",{"v":2.5305,"d":"2.53"},{"v":9.5195,"d":"9.52"},{"v":110.5,"d":"111 m"},{"v":127.16097034286693,"d":"127 m"},"Hyperoxie","Narcose"]
[24.2,232,"m",{"v":5.082,"d":"5.08"},{"v":19.118,"d":"19.12"},{"v":231.99999999999997,"d":"232 m"},"Hyperoxie","Narcose",null,232,"m",{"v":2.541,"d":"2.54"},{"v":9.559,"d":"9.56"},{"v":110.99999999999999,"d":"111 m"},{"v":127.73010299989124,"d":"128 m"},"Hyperoxie","Narcose"]
[24.3,233,"m",{"v":5.103,"d":"5.10"},{"v":19.197,"d":"19.20"},{"v":233,"d":"233 m"},"Hyperoxie","Narcose",null,233,"m",{"v":2.5515,"d":"2.55"},{"v":9.5985,"d":"9.60"},{"v":111.5,"d":"112 m"},{"v":128.2992356569156,"d":"128 m"},"Hyperoxie","Narcose"]
[24.4,234,"m",{"v":5.124,"d":"5.12"},{"v":19.276,"d":"19.28"},{"v":233.99999999999997,"d":"234 m"},"Hyperoxie","Narcose",null,234,"m",{"v":2.562,"d":"2.56"},{"v":9.638,"d":"9.64"},{"v":111.99999999999999,"d":"112 m"},{"v":128.86836831393995,"d":"129 m"},"Hyperoxie","Narcose"]
[24.5,235,"m",{"v":5.145,"d":"5.15"},{"v":19.355,"d":"19.36"},{"v":235,"d":"235 m"},"Hyperoxie","Narcose",null,235,"m",{"v":2.5725,"d":"2.57"},{"v":9.6775,"d":"9.68"},{"v":112.5,"d":"113 m"},{"v":129.4375009709643,"d":"129 m"},"Hyperoxie","Narcose"]
[24.6,236,"m",{"v":5.166,"d":"5.17"},{"v":19.434,"d":"19.43"},{"v":236,"d":"236 m"},"Hyperoxie","Narcose",null,236,"m",{"v":2.583,"d":"2.58"},{"v":9.717,"d":"9.72"},{"v":113,"d":"113 m"},{"v":130.00663362798863,"d":"130 m"},"Hyperoxie","Narcose"]
[24.7,237,"m",{"v":5.186999999999999,"d":"5.19"},{"v":19.512999999999998,"d":"19.51"},{"v":236.99999999999997,"d":"237 m"},"Hyperoxie","Narcose",null,237,"m",{"v":2.5934999999999997,"d":"2.59"},{"v":9.756499999999999,"d":"9.76"},{"v":113.49999999999999,"d":"114 m"},{"v":130.57576628501297,"d":"131 m"},"Hyperoxie","Narcose"]
[24.8,238,"m",{"v":5.208000000000001,"d":"5.21"},{"v":19.592,"d":"19.59"},{"v":237.99999999999997,"d":"238 m"},"Hyperoxie","Narcose",null,238,"m",{"v":2.6040000000000005,"d":"2.60"},{"v":9.796,"d":"9.80"},{"v":113.99999999999999,"d":"114 m"},{"v":131.14489894203734,"d":"131 m"},"Hyperoxie","Narcose"]
[24.9,239,"m",{"v":5.229,"d":"5.23"},{"v":19.671,"d":"19.67"},{"v":238.99999999999997,"d":"239 m"},"Hyperoxie","Narcose",null,239,"m",{"v":2.6145,"d":"2.61"},{"v":9.8355,"d":"9.84"},{"v":114.49999999999999,"d":"115 m"},{"v":131.71403159906168,"d":"132 m"},"Hyperoxie","Narcose"]
[25,240,"m",5.25,19.75,{"v":240,"d":"240 m"},"Hyperoxie","Narcose",null,240,"m",{"v":2.625,"d":"2.63"},{"v":9.875,"d":"9.88"},{"v":115,"d":"115 m"},{"v":132.28316425608602,"d":"132 m"},"Hyperoxie","Narcose"]
[25.1,241,"m",{"v":5.271,"d":"5.27"},{"v":19.829,"d":"19.83"},{"v":241.00000000000003,"d":"241 m"},"Hyperoxie","Narcose",null,241,"m",{"v":2.6355,"d":"2.64"},{"v":9.9145,"d":"9.91"},{"v":115.50000000000001,"d":"116 m"},{"v":132.85229691311037,"d":"133 m"},"Hyperoxie","Narcose"]
[25.2,242,"m",{"v":5.291999999999999,"d":"5.29"},{"v":19.908,"d":"19.91"},{"v":242,"d":"242 m"},"Hyperoxie","Narcose",null,242,"m",{"v":2.6459999999999995,"d":"2.65"},{"v":9.954,"d":"9.95"},{"v":116,"d":"116 m"},{"v":133.4214295701347,"d":"133 m"},"Hyperoxie","Narcose"]
[25.3,243,"m",{"v":5.313000000000001,"d":"5.31"},{"v":19.987000000000002,"d":"19.99"},{"v":243,"d":"243 m"},"Hyperoxie","Narcose",null,243,"m",{"v":2.6565000000000003,"d":"2.66"},{"v":9.993500000000001,"d":"9.99"},{"v":116.5,"d":"117 m"},{"v":133.99056222715905,"d":"134 m"},"Hyperoxie","Narcose"]
[25.4,244,"m",{"v":5.334,"d":"5.33"},{"v":20.066,"d":"20.07"},{"v":243.99999999999997,"d":"244 m"},"Hyperoxie","Narcose",null,244,"m",{"v":2.667,"d":"2.67"},{"v":10.033,"d":"10.03"},{"v":116.99999999999999,"d":"117 m"},{"v":134.5596948841834,"d":"135 m"},"Hyperoxie","Narcose"]
[25.5,245,"m",{"v":5.355,"d":"5.36"},{"v":20.145,"d":"20.15"},{"v":244.99999999999997,"d":"245 m"},"Hyperoxie","Narcose",null,245,"m",{"v":2.6775,"d":"2.68"},{"v":10.0725,"d":"10.07"},{"v":117.49999999999999,"d":"118 m"},{"v":135.12882754120773,"d":"135 m"},"Hyperoxie","Narcose"]
[25.6,246,"m",{"v":5.376,"d":"5.38"},{"v":20.224,"d":"20.22"},{"v":246,"d":"246 m"},"Hyperoxie","Narcose",null,246,"m",{"v":2.688,"d":"2.69"},{"v":10.112,"d":"10.11"},{"v":118,"d":"118 m"},{"v":135.6979601982321,"d":"136 m"},"Hyperoxie","Narcose"]
[25.7,247,"m",{"v":5.396999999999999,"d":"5.40"},{"v":20.303,"d":"20.30"},{"v":247,"d":"247 m"},"Hyperoxie","Narcose",null,247,"m",{"v":2.6984999999999997,"d":"2.70"},{"v":10.1515,"d":"10.15"},{"v":118.5,"d":"119 m"},{"v":136.2670928552564,"d":"136 m"},"Hyperoxie","Narcose"]
[25.8,248,"m",{"v":5.418000000000001,"d":"5.42"},{"v":20.382,"d":"20.38"},{"v":248,"d":"248 m"},"Hyperoxie","Narcose",null,248,"m",{"v":2.7090000000000005,"d":"2.71"},{"v":10.191,"d":"10.19"},{"v":119,"d":"119 m"},{"v":136.83622551228078,"d":"137 m"},"Hyperoxie","Narcose"]
[25.9,249,"m",{"v":5.439,"d":"5.44"},{"v":20.461,"d":"20.46"},{"v":248.99999999999994,"d":"249 m"},"Hyperoxie","Narcose",null,249,"m",{"v":2.7195,"d":"2.72"},{"v":10.2305,"d":"10.23"},{"v":119.49999999999997,"d":"120 m"},{"v":137.4053581693051,"d":"137 m"},"Hyperoxie","Narcose"]
[26,250,"m",5.46,20.54,{"v":249.99999999999994,"d":"250 m"},"Hyperoxie","Narcose",null,250,"m",2.73,10.27,{"v":119.99999999999997,"d":"120 m"},{"v":137.9744908263295,"d":"138 m"},"Hyperoxie","Narcose"]
[26.1,251,"m",{"v":5.481,"d":"5.48"},{"v":20.619,"d":"20.62"},{"v":251,"d":"251 m"},"Hyperoxie","Narcose",null,251,"m",{"v":2.7405,"d":"2.74"},{"v":10.3095,"d":"10.31"},{"v":120.5,"d":"121 m"},{"v":138.54362348335383,"d":"139 m"},"Hyperoxie","Narcose"]
[26.2,252,"m",{"v":5.501999999999999,"d":"5.50"},{"v":20.697999999999997,"d":"20.70"},{"v":251.99999999999994,"d":"252 m"},"Hyperoxie","Narcose",null,252,"m",{"v":2.7509999999999994,"d":"2.75"},{"v":10.348999999999998,"d":"10.35"},{"v":120.99999999999997,"d":"121 m"},{"v":139.11275614037817,"d":"139 m"},"Hyperoxie","Narcose"]
[26.3,253,"m",{"v":5.523000000000001,"d":"5.52"},{"v":20.777,"d":"20.78"},{"v":253,"d":"253 m"},"Hyperoxie","Narcose",null,253,"m",{"v":2.7615000000000003,"d":"2.76"},{"v":10.3885,"d":"10.39"},{"v":121.5,"d":"122 m"},{"v":139.6818887974025,"d":"140 m"},"Hyperoxie","Narcose"]
[26.4,254,"m",{"v":5.544,"d":"5.54"},{"v":20.855999999999998,"d":"20.86"},{"v":253.99999999999994,"d":"254 m"},"Hyperoxie","Narcose",null,254,"m",{"v":2.772,"d":"2.77"},{"v":10.427999999999999,"d":"10.43"},{"v":121.99999999999997,"d":"122 m"},{"v":140.25102145442685,"d":"140 m"},"Hyperoxie","Narcose"]
[26.5,255,"m",{"v":5.565,"d":"5.57"},{"v":20.935,"d":"20.94"},{"v":255,"d":"255 m"},"Hyperoxie","Narcose",null,255,"m",{"v":2.7825,"d":"2.78"},{"v":10.4675,"d":"10.47"},{"v":122.5,"d":"123 m"},{"v":140.8201541114512,"d":"141 m"},"Hyperoxie","Narcose"]
[26.6,256,"m",{"$f":"((B306/10)+1)*$N$31/100","v":{"v":5.586,"d":"5.59"}},{"$f":"((B306/10)+1)*$N$33/100","v":{"v":21.014,"d":"21.01"}},{"v":255.99999999999994,"d":"256 m"},"Hyperoxie","Narcose",null,256,"m",{"v":2.793,"d":"2.79"},{"v":10.507,"d":"10.51"},{"v":122.99999999999997,"d":"123 m"},{"v":141.38928676847553,"d":"141 m"},"Hyperoxie","Narcose"]
[26.7,257,"m",{"v":5.606999999999999,"d":"5.61"},{"v":21.092999999999996,"d":"21.09"},{"$f":"IF(E307<0.79,0,(10*E307)/0.79-7.9/0.79)","v":{"v":256.99999999999994,"d":"257 m"}},{"$f":"IF(D307>1.47,\"Hyperoxie\",IF(D307<0.19,\"Hypoxie\",\"\"))","v":"Hyperoxie"},{"$f":"IF(E307>5.53,\"Narcose\",IF(E307>3.56,\"pne>35m\",\"\"))","v":"Narcose"},null,257,"m",{"$f":"((J307/10)+1)*$D$22/100","v":{"v":2.8034999999999997,"d":"2.80"}},{"$f":"((J307/10)+1)*$D$21/100","v":{"v":10.546499999999998,"d":"10.55"}},{"$f":"IF(M307<0.79,0,(10*M307)/0.79-7.9/0.79)","v":{"v":123.49999999999997,"d":"124 m"}},{"$f":"(((((($E$18%*1.428)+($F$18%*0.178)+($D$21%*1.25))*A307))/1.28738)*10)-10","v":{"v":141.95841942549987,"d":"142 m"}},{"$f":"IF(L307>1.47,\"Hyperoxie\",IF(L307<0.19,\"Hypoxie\",\"\"))","v":"Hyperoxie"},{"$f":"IF(M307>5.53,\"Narcose\",IF(M307>3.56,\"pne > 35m\",\"\"))","v":"Narcose"}]
[{"$f":"(B308/10)+1","v":26.8},258,"m",{"v":5.628000000000001,"d":"5.63"},{"v":21.172000000000004,"d":"21.17"},{"v":258,"d":"258 m"},"Hyperoxie","Narcose",null,258,"m",{"v":2.8140000000000005,"d":"2.81"},{"v":10.586000000000002,"d":"10.59"},{"v":124,"d":"124 m"},{"v":142.5275520825242,"d":"143 m"},"Hyperoxie","Narcose"]
[26.9,259,"m",{"v":5.649,"d":"5.65"},{"v":21.250999999999998,"d":"21.25"},{"v":259,"d":"259 m"},"Hyperoxie","Narcose",null,259,"m",{"v":2.8245,"d":"2.82"},{"v":10.625499999999999,"d":"10.63"},{"v":124.5,"d":"125 m"},{"v":143.09668473954855,"d":"143 m"},"Hyperoxie","Narcose"]
[27,260,"m",5.67,21.33,{"v":259.99999999999994,"d":"260 m"},"Hyperoxie","Narcose",null,260,"m",{"v":2.835,"d":"2.84"},{"v":10.665,"d":"10.67"},{"v":124.99999999999997,"d":"125 m"},{"v":143.6658173965729,"d":"144 m"},"Hyperoxie","Narcose"]
[27.1,261,"m",{"v":5.691,"d":"5.69"},{"v":21.409000000000002,"d":"21.41"},{"v":261,"d":"261 m"},"Hyperoxie","Narcose",null,261,"m",{"v":2.8455,"d":"2.85"},{"v":10.704500000000001,"d":"10.70"},{"v":125.5,"d":"126 m"},{"v":144.23495005359726,"d":"144 m"},"Hyperoxie","Narcose"]
[27.2,262,"m",{"v":5.712,"d":"5.71"},{"v":21.487999999999996,"d":"21.49"},{"v":261.99999999999994,"d":"262 m"},"Hyperoxie","Narcose",null,262,"m",{"v":2.856,"d":"2.86"},{"v":10.743999999999998,"d":"10.74"},{"v":125.99999999999997,"d":"126 m"},{"v":144.80408271062157,"d":"145 m"},"Hyperoxie","Narcose"]
[27.3,263,"m",{"v":5.7330000000000005,"d":"5.73"},{"v":21.567000000000004,"d":"21.57"},{"v":263.00000000000006,"d":"263 m"},"Hyperoxie","Narcose",null,263,"m",{"v":2.8665000000000003,"d":"2.87"},{"v":10.783500000000002,"d":"10.78"},{"v":126.50000000000003,"d":"127 m"},{"v":145.37321536764597,"d":"145 m"},"Hyperoxie","Narcose"]
[27.4,264,"m",{"v":5.754,"d":"5.75"},{"v":21.646,"d":"21.65"},{"v":264,"d":"264 m"},"Hyperoxie","Narcose",null,264,"m",{"v":2.877,"d":"2.88"},{"v":10.823,"d":"10.82"},{"v":127,"d":"127 m"},{"v":145.94234802467025,"d":"146 m"},"Hyperoxie","Narcose"]
[27.5,265,"m",{"v":5.775,"d":"5.78"},{"v":21.725,"d":"21.73"},{"v":265,"d":"265 m"},"Hyperoxie","Narcose",null,265,"m",{"v":2.8875,"d":"2.89"},{"v":10.8625,"d":"10.86"},{"v":127.5,"d":"128 m"},{"v":146.5114806816946,"d":"147 m"},"Hyperoxie","Narcose"]
[27.6,266,"m",{"v":5.796,"d":"5.80"},{"v":21.804000000000002,"d":"21.80"},{"v":266,"d":"266 m"},"Hyperoxie","Narcose",null,266,"m",{"v":2.898,"d":"2.90"},{"v":10.902000000000001,"d":"10.90"},{"v":128,"d":"128 m"},{"v":147.080613338719,"d":"147 m"},"Hyperoxie","Narcose"]
[27.7,267,"m",{"v":5.816999999999999,"d":"5.82"},{"v":21.882999999999996,"d":"21.88"},{"v":266.99999999999994,"d":"267 m"},"Hyperoxie","Narcose",null,267,"m",{"v":2.9084999999999996,"d":"2.91"},{"v":10.941499999999998,"d":"10.94"},{"v":128.49999999999997,"d":"129 m"},{"v":147.6497459957433,"d":"148 m"},"Hyperoxie","Narcose"]
[27.8,268,"m",{"v":5.838000000000001,"d":"5.84"},{"v":21.962000000000003,"d":"21.96"},{"v":268.00000000000006,"d":"268 m"},"Hyperoxie","Narcose",null,268,"m",{"v":2.9190000000000005,"d":"2.92"},{"v":10.981000000000002,"d":"10.98"},{"v":129.00000000000003,"d":"129 m"},{"v":148.21887865276767,"d":"148 m"},"Hyperoxie","Narcose"]
[27.9,269,"m",{"v":5.859,"d":"5.86"},{"v":22.041,"d":"22.04"},{"v":269,"d":"269 m"},"Hyperoxie","Narcose",null,269,"m",{"v":2.9295,"d":"2.93"},{"v":11.0205,"d":"11.02"},{"v":129.5,"d":"130 m"},{"v":148.78801130979198,"d":"149 m"},"Hyperoxie","Narcose"]
[28,270,"m",5.88,22.12,{"v":270,"d":"270 m"},"Hyperoxie","Narcose",null,270,"m",2.94,11.06,{"v":130,"d":"130 m"},{"v":149.35714396681635,"d":"149 m"},"Hyperoxie","Narcose"]
[28.1,271,"m",{"v":5.901,"d":"5.90"},{"v":22.199,"d":"22.20"},{"v":271,"d":"271 m"},"Hyperoxie","Narcose",null,271,"m",{"v":2.9505,"d":"2.95"},{"v":11.0995,"d":"11.10"},{"v":130.5,"d":"131 m"},{"v":149.9262766238407,"d":"150 m"},"Hyperoxie","Narcose"]
[28.2,272,"m",{"v":5.922,"d":"5.92"},{"v":22.278,"d":"22.28"},{"v":271.99999999999994,"d":"272 m"},"Hyperoxie","Narcose",null,272,"m",{"v":2.961,"d":"2.96"},{"v":11.139,"d":"11.14"},{"v":130.99999999999997,"d":"131 m"},{"v":150.49540928086503,"d":"150 m"},"Hyperoxie","Narcose"]
[28.3,273,"m",{"v":5.9430000000000005,"d":"5.94"},{"v":22.357000000000003,"d":"22.36"},{"v":273,"d":"273 m"},"Hyperoxie","Narcose",null,273,"m",{"v":2.9715000000000003,"d":"2.97"},{"v":11.178500000000001,"d":"11.18"},{"v":131.5,"d":"132 m"},{"v":151.06454193788937,"d":"151 m"},"Hyperoxie","Narcose"]
[28.4,274,"m",{"v":5.9639999999999995,"d":"5.96"},{"v":22.436,"d":"22.44"},{"v":274,"d":"274 m"},"Hyperoxie","Narcose",null,274,"m",{"v":2.9819999999999998,"d":"2.98"},{"v":11.218,"d":"11.22"},{"v":132,"d":"132 m"},{"v":151.6336745949137,"d":"152 m"},"Hyperoxie","Narcose"]
[28.5,275,"m",{"v":5.985,"d":"5.99"},{"v":22.515,"d":"22.52"},{"v":275,"d":"275 m"},"Hyperoxie","Narcose",null,275,"m",{"v":2.9925,"d":"2.99"},{"v":11.2575,"d":"11.26"},{"v":132.5,"d":"133 m"},{"v":152.20280725193805,"d":"152 m"},"Hyperoxie","Narcose"]
[28.6,276,"m",{"v":6.006,"d":"6.01"},{"v":22.594,"d":"22.59"},{"v":276,"d":"276 m"},"Hyperoxie","Narcose",null,276,"m",{"v":3.003,"d":"3.00"},{"v":11.297,"d":"11.30"},{"v":133,"d":"133 m"},{"v":152.7719399089624,"d":"153 m"},"Hyperoxie","Narcose"]
[28.7,277,"m",{"v":6.026999999999999,"d":"6.03"},{"v":22.673,"d":"22.67"},{"v":277,"d":"277 m"},"Hyperoxie","Narcose",null,277,"m",{"v":3.0134999999999996,"d":"3.01"},{"v":11.3365,"d":"11.34"},{"v":133.5,"d":"134 m"},{"v":153.34107256598674,"d":"153 m"},"Hyperoxie","Narcose"]
[28.8,278,"m",{"v":6.048000000000001,"d":"6.05"},{"v":22.752000000000002,"d":"22.75"},{"v":278.00000000000006,"d":"278 m"},"Hyperoxie","Narcose",null,278,"m",{"v":3.0240000000000005,"d":"3.02"},{"v":11.376000000000001,"d":"11.38"},{"v":134.00000000000003,"d":"134 m"},{"v":153.91020522301108,"d":"154 m"},"Hyperoxie","Narcose"]
[28.9,279,"m",{"v":6.069,"d":"6.07"},{"v":22.831,"d":"22.83"},{"v":279,"d":"279 m"},"Hyperoxie","Narcose",null,279,"m",{"v":3.0345,"d":"3.03"},{"v":11.4155,"d":"11.42"},{"v":134.5,"d":"135 m"},{"v":154.47933788003542,"d":"154 m"},"Hyperoxie","Narcose"]
[29,280,"m",6.09,22.91,{"v":280,"d":"280 m"},"Hyperoxie","Narcose",null,280,"m",{"v":3.045,"d":"3.05"},{"v":11.455,"d":"11.46"},{"v":135,"d":"135 m"},{"v":155.04847053705976,"d":"155 m"},"Hyperoxie","Narcose"]
[29.1,281,"m",{"v":6.111000000000001,"d":"6.11"},{"v":22.989,"d":"22.99"},{"v":281,"d":"281 m"},"Hyperoxie","Narcose",null,281,"m",{"v":3.0555000000000003,"d":"3.06"},{"v":11.4945,"d":"11.49"},{"v":135.5,"d":"136 m"},{"v":155.61760319408415,"d":"156 m"},"Hyperoxie","Narcose"]
[29.2,282,"m",{"v":6.132,"d":"6.13"},{"v":23.067999999999998,"d":"23.07"},{"v":281.99999999999994,"d":"282 m"},"Hyperoxie","Narcose",null,282,"m",{"v":3.066,"d":"3.07"},{"v":11.533999999999999,"d":"11.53"},{"v":135.99999999999997,"d":"136 m"},{"v":156.18673585110844,"d":"156 m"},"Hyperoxie","Narcose"]
[29.3,283,"m",{"v":6.1530000000000005,"d":"6.15"},{"v":23.147000000000002,"d":"23.15"},{"v":283,"d":"283 m"},"Hyperoxie","Narcose",null,283,"m",{"v":3.0765000000000002,"d":"3.08"},{"v":11.573500000000001,"d":"11.57"},{"v":136.5,"d":"137 m"},{"v":156.75586850813283,"d":"157 m"},"Hyperoxie","Narcose"]
[29.4,284,"m",{"v":6.1739999999999995,"d":"6.17"},{"v":23.226,"d":"23.23"},{"v":284,"d":"284 m"},"Hyperoxie","Narcose",null,284,"m",{"v":3.0869999999999997,"d":"3.09"},{"v":11.613,"d":"11.61"},{"v":137,"d":"137 m"},{"v":157.32500116515718,"d":"157 m"},"Hyperoxie","Narcose"]
[29.5,285,"m",{"v":6.195,"d":"6.20"},{"v":23.305,"d":"23.31"},{"v":285,"d":"285 m"},"Hyperoxie","Narcose",null,285,"m",{"v":3.0975,"d":"3.10"},{"v":11.6525,"d":"11.65"},{"v":137.5,"d":"138 m"},{"v":157.89413382218152,"d":"158 m"},"Hyperoxie","Narcose"]
[29.6,286,"m",{"v":6.216,"d":"6.22"},{"v":23.384,"d":"23.38"},{"v":286,"d":"286 m"},"Hyperoxie","Narcose",null,286,"m",{"v":3.108,"d":"3.11"},{"v":11.692,"d":"11.69"},{"v":138,"d":"138 m"},{"v":158.46326647920586,"d":"158 m"},"Hyperoxie","Narcose"]
[29.7,287,"m",{"v":6.236999999999999,"d":"6.24"},{"v":23.462999999999997,"d":"23.46"},{"v":286.99999999999994,"d":"287 m"},"Hyperoxie","Narcose",null,287,"m",{"v":3.1184999999999996,"d":"3.12"},{"v":11.731499999999999,"d":"11.73"},{"v":138.49999999999997,"d":"139 m"},{"v":159.0323991362302,"d":"159 m"},"Hyperoxie","Narcose"]
[29.8,288,"m",{"v":6.258000000000001,"d":"6.26"},{"v":23.542,"d":"23.54"},{"v":288,"d":"288 m"},"Hyperoxie","Narcose",null,288,"m",{"v":3.1290000000000004,"d":"3.13"},{"v":11.771,"d":"11.77"},{"v":139,"d":"139 m"},{"v":159.60153179325457,"d":"160 m"},"Hyperoxie","Narcose"]
[29.9,289,"m",{"v":6.279,"d":"6.28"},{"v":23.621,"d":"23.62"},{"v":288.99999999999994,"d":"289 m"},"Hyperoxie","Narcose",null,289,"m",{"v":3.1395,"d":"3.14"},{"v":11.8105,"d":"11.81"},{"v":139.49999999999997,"d":"140 m"},{"v":160.1706644502789,"d":"160 m"},"Hyperoxie","Narcose"]
[30,290,"m",{"v":6.3,"d":"6.30"},{"v":23.7,"d":"23.70"},{"v":290,"d":"290 m"},"Hyperoxie","Narcose",null,290,"m",3.15,11.85,{"v":140,"d":"140 m"},{"v":160.73979710730325,"d":"161 m"},"Hyperoxie","Narcose"]
[30.1,291,"m",{"v":6.321000000000001,"d":"6.32"},{"v":23.779,"d":"23.78"},{"v":291,"d":"291 m"},"Hyperoxie","Narcose",null,291,"m",{"v":3.1605000000000003,"d":"3.16"},{"v":11.8895,"d":"11.89"},{"v":140.5,"d":"141 m"},{"v":161.3089297643276,"d":"161 m"},"Hyperoxie","Narcose"]
[30.2,292,"m",{"v":6.342,"d":"6.34"},{"v":23.857999999999997,"d":"23.86"},{"v":291.99999999999994,"d":"292 m"},"Hyperoxie","Narcose",null,292,"m",{"v":3.171,"d":"3.17"},{"v":11.928999999999998,"d":"11.93"},{"v":140.99999999999997,"d":"141 m"},{"v":161.87806242135193,"d":"162 m"},"Hyperoxie","Narcose"]
[30.3,293,"m",{"v":6.363,"d":"6.36"},{"v":23.937,"d":"23.94"},{"v":293,"d":"293 m"},"Hyperoxie","Narcose",null,293,"m",{"v":3.1815,"d":"3.18"},{"v":11.9685,"d":"11.97"},{"v":141.5,"d":"142 m"},{"v":162.44719507837627,"d":"162 m"},"Hyperoxie","Narcose"]
[30.4,294,"m",{"v":6.3839999999999995,"d":"6.38"},{"v":24.016,"d":"24.02"},{"v":293.99999999999994,"d":"294 m"},"Hyperoxie","Narcose",null,294,"m",{"v":3.1919999999999997,"d":"3.19"},{"v":12.008,"d":"12.01"},{"v":141.99999999999997,"d":"142 m"},{"v":163.0163277354006,"d":"163 m"},"Hyperoxie","Narcose"]
[30.5,295,"m",{"v":6.405,"d":"6.41"},{"v":24.095,"d":"24.10"},{"v":295,"d":"295 m"},"Hyperoxie","Narcose",null,295,"m",{"v":3.2025,"d":"3.20"},{"v":12.0475,"d":"12.05"},{"v":142.5,"d":"143 m"},{"v":163.58546039242495,"d":"164 m"},"Hyperoxie","Narcose"]
[30.6,296,"m",{"v":6.426,"d":"6.43"},{"v":24.174,"d":"24.17"},{"v":296,"d":"296 m"},"Hyperoxie","Narcose",null,296,"m",{"v":3.213,"d":"3.21"},{"v":12.087,"d":"12.09"},{"v":143,"d":"143 m"},{"v":164.15459304944932,"d":"164 m"},"Hyperoxie","Narcose"]
[30.7,297,"m",{"v":6.446999999999999,"d":"6.45"},{"v":24.252999999999997,"d":"24.25"},{"v":296.99999999999994,"d":"297 m"},"Hyperoxie","Narcose",null,297,"m",{"v":3.2234999999999996,"d":"3.22"},{"v":12.126499999999998,"d":"12.13"},{"v":143.49999999999997,"d":"144 m"},{"v":164.72372570647363,"d":"165 m"},"Hyperoxie","Narcose"]
[30.8,298,"m",{"v":6.468000000000001,"d":"6.47"},{"v":24.332000000000004,"d":"24.33"},{"v":298.00000000000006,"d":"298 m"},"Hyperoxie","Narcose",null,298,"m",{"v":3.2340000000000004,"d":"3.23"},{"v":12.166000000000002,"d":"12.17"},{"v":144.00000000000003,"d":"144 m"},{"v":165.29285836349797,"d":"165 m"},"Hyperoxie","Narcose"]
[30.9,299,"m",{"v":6.489,"d":"6.49"},{"v":24.410999999999998,"d":"24.41"},{"v":298.99999999999994,"d":"299 m"},"Hyperoxie","Narcose",null,299,"m",{"v":3.2445,"d":"3.24"},{"v":12.205499999999999,"d":"12.21"},{"v":144.49999999999997,"d":"145 m"},{"v":165.8619910205223,"d":"166 m"},"Hyperoxie","Narcose"]
[31,300,"m",6.51,24.49,{"v":299.99999999999994,"d":"300 m"},"Hyperoxie","Narcose",null,300,"m",{"v":3.255,"d":"3.26"},{"v":12.245,"d":"12.25"},{"v":144.99999999999997,"d":"145 m"},{"v":166.43112367754665,"d":"166 m"},"Hyperoxie","Narcose"]

{"sheet":"2","index":4,"n_rows":59,"n_cols":18,"rows_kept":59,"merged":[[1,4,1,14],[2,1,2,3],[3,1,3,3],[4,0,4,2],[5,0,5,2],[7,1,7,19],[8,2,8,16],[9,0,9,18],[9,20,9,23],[10,2,12,17],[10,20,12,21],[10,22,12,22],[10,23,12,23],[15,7,15,11],[16,1,16,5],[17,1,17,5],[17,13,18,17],[19,2,19,3],[19,14,19,17],[20,2,20,3],[20,7,21,9],[20,10,21,10],[20,11,21,11],[20,14,20,17],[21,14,21,17],[22,14,22,17],[23,1,23,5],[23,7,23,11],[23,14,23,17],[24,1,24,5],[24,7,25,12],[24,14,25,17],[26,15,27,16],[27,8,27,9],[27,10,27,11],[28,14,28,15],[30,14,30,17],[31,1,31,5],[31,10,31,11],[31,15,32,16],[32,1,32,5],[32,9,32,11],[33,1,33,2],[34,1,34,2],[34,3,35,3],[34,5,34,8],[35,1,35,2],[36,1,36,3],[36,9,36,11],[41,6,41,9],[42,4,42,11],[43,5,43,6],[43,7,43,8],[44,5,44,6],[44,7,44,8],[45,5,45,6],[45,7,45,8],[46,4,47,6],[46,7,47,8],[46,9,47,9],[46,10,47,10],[46,11,47,11],[48,4,49,6],[48,7,49,8],[48,9,49,9],[48,10,49,10],[48,11,49,11],[50,4,51,8],[50,9,51,9],[50,11,51,11]]}
[]
[{"$nulls":4},"AVERTISSEMENT"]
[]
[{"$nulls":4},"Les phénomènes de compressibilité des gaz, ne sont pas pris en compte dans ce tableur, attention aux pressions élevées ."]
["JP Couloumy",{"$nulls":3},"Pour des commodités de lecture, certains chiffres sont arrondis au chiffre  > ou < , c'est pourquoi il peut y avoir une légère différence d'un tableau à l'autre !"]
[{"$nulls":4},"PP. max pour ",null,"O2 = 1,47 (60m air)  et  1,62 paliers     ",{"$nulls":4},"           N2 = 5,53 ( 60m air )"]
[{"$nulls":4},"PP Mini pour O2 = 0,19",{"$nulls":3},"           % mini O2= 4%"]
[null,"Pour  trimix, héliox,  l'alarme PPO2 s'active au delà de 1,47 ; si besoin de trimix hyperoxique ( + de 21 % d'O2 ), alors  considérer sa PPO2 comme celle d' un nitrox . "]
[null,null,"REMPILAGE  "]
["  TRANSFORMER  le  RESTANT  d'un  TRIMIX, HELIOX, HELIAIR,  ou NITROX"]
[null,null,"en  RAJOUTANT     02  ,  N2,   Air,   Nitrox,   ou  Hélium    "]
[]
[]
[]
[]
[{"$nulls":7}," (3)  MELANGE DESIRE"]
[null,"(1)  RESTE",{"$nulls":6},"% O2  =",7,"L d' 02 =",{"$f":"J17/100*J23","v":42.00000000000001}]
[null,"dans la BOUTEILLE de PLONGEE :",{"$nulls":6},"% Hé  =",66,"L d' Hé =",{"$f":"J18/100*J23","v":396},null,"ZONE   DANGER"]
[{"$nulls":8},"% N2  =",{"$f":"IF(J17=0,\"0\",IF(J18=0,100-J17,IF(J18>0,100-(J17+J18))))","v":27},"L d' N2 =",{"$f":"J19/100*J23","v":162}]
[null,null,"pression restante",null,100,{"$nulls":3},"TOTAL",{"$f":"J17+J18+J19","v":100},"TOTAL",{"$f":"(L17+L18+L19)","v":600},null,null,{"$f":"IF(P30<0.19,\"HYPOXIE   !!!!!! \",\"\")","v":""}]
[null,null,"capacité bouteille",null,3,null,null,{"$f":"IF(K21<=220,\"pression désirée\",\"pression élevée ! ! !\")","v":"pression désirée"},null,null,200,"bars",null,null,{"$f":"IF(J18>0,\"\",IF(P30>1.62,\"HYPEROXIE  !!!!! \",\"\"))","v":""}]
[null,{"$f":"IF(E21=0,\"bouteille 0 litre ?\",\"\")","v":""},{"$nulls":12},{"$f":"IF(J18=0,\"\",IF(P30>1.47,\"HYPEROXIE  !!!!! \",\"\"))","v":""}]
[{"$nulls":3},"litres total   =",{"$f":"E21*E20","v":300},"litres",null,null,"litres total    =",{"$f":"E21*K21","v":600},{"$nulls":4},{"$f":"IF(R30>5.53,\"NARCOSE  !!!!!\",\"\")","v":""}]
[null,"(2)  % MELANGE RESTANT",{"$nulls":5},{"$f":"IF(E20>0,IF(D26+D27=0,\"Pression restante doit être = à zéro !\",\"\"),\"\")","v":""},{"$nulls":6},"(5)    Profondeur : plongée ou palier"]
[null,{"$f":"IF(D28<0,\"IMPOSSIBLE !\",\"\")","v":""},{"$nulls":5},"(4)  GAZ  A  RAJOUTER",{"$nulls":6},{"$f":"IF(J18>0,\"PROF.  TRIMIX\",\"PROF.  NITROX\")","v":"PROF.  TRIMIX"}]
[null,null,"% O2  =",10,"L d' 02 =",{"$f":"D26/100*E23","v":30},{"$nulls":7},"litres"]
[null,null,"% Hé  =",50,"L d' Hé =",{"$f":"D27/100*E23","v":150},{"$nulls":9},130,null,"m"]
[null,null,"% N2  =",{"$f":"IF(D26=0,\"0\",IF(D27=0,100-D26,IF(D27>0,100-(D26+D27))))","v":40},"L d' N2 =",{"$f":"D28/100*E23","v":120},null,null,{"$f":"IF(J29<0,\"IMPOSSIBLE !\",IF(J30<0,\"IMPOSSIBLE !\",IF(J31<0,\"IMPOSSIBLE !\",\"soit : avec 3 gaz\")))","v":"soit : avec 3 gaz"},null,{"$f":"IF(L29<0,\"IMPOSSIBLE !\",IF(L30<0,\"IMPOSSIBLE !\",IF(L31<0,\"IMPOSSIBLE !\",\"soit : avec 2 gaz + Air\")))","v":"soit : avec 2 gaz + Air"}]
[null,null,"TOTAL",{"$f":"D26+D27+D28","v":100},"TOTAL",{"$f":"(F26+F27+F28)","v":300},null,null," O2  =",{"$f":"(L17-F26)/E21","v":{"v":4.000000000000003,"d":"4b"}},"O2",{"$f":"(J29+J30+J31)-(L31+L30)","v":{"v":0.2784810126582329,"d":"0.3"}},"b",null,{"$f":"IF(O25=\"PROF.  TRIMIX\",\"( Max O2  = 1,47 )\",IF(O25=\"PROF.  NITROX\",\"( Max O2  = 1,62 )\"))","v":"( Max O2  = 1,47 )"},null,{"$f":"IF(O25=\"TRIMIX\",\"( Max  = 5,53 )\",\"\")","v":""}]
[{"$nulls":8}," Hé  =",{"$f":"(L18-F27)/E21","v":{"v":82,"d":"82b"}},"Hé",{"$f":"J30","v":{"v":82,"d":"82.0"}},"b",null,"PP 02 =",{"$f":"((P27/10)+1)*J17/100","v":0.98}," PP N2 =",{"$f":"((P27/10)+1)*J19/100","v":3.78}]
[{"$nulls":6},"b N2=",null," N2  =",{"$f":"(L19-F28)/E21","v":{"v":14,"d":"14b"}},"Air",{"$f":"100/79*J31","v":{"v":17.721518987341774,"d":"17.7"}},"b",null,{"$f":"IF(J18=0,\"PeA\",\"PNe\")","v":"PNe"}]
[null,"(3 bis)   Rempilage sans rajout d'hélium",{"$nulls":4},{"$f":"(100-D34)/100*(D35-E20)","v":0},{"$nulls":8},{"$f":"IF(R30<0.79,\"O\",(10*R30)/0.79-7.9/0.79)","v":{"v":37.84810126582278,"d":"38"}}]
[null,"avec seuleument  :  Nitrox, ou Air, ou O2",{"$nulls":4},{"$f":"G32*E21","v":0},null,null,{"$f":"IF(L34<0,\"IMPOSSIBLE !\",IF(L35<0,\"IMPOSSIBLE !\",IF(L36<0,\"IMPOSSIBLE !\",\"soit : avec     Hé + nitrox + Air\")))","v":"soit : avec     Hé + nitrox + Air"},{"$nulls":7},"m"]
[null,{"$f":"IF(D34<21,\"? ? ?\",IF(D34=21,\"Air\",IF(D34=100,\"O2\",IF(D34>21,\"Nitrox\"))))","v":"O2"},null,100,{"$f":"D34/100*(D35-E20)","v":100},"Tot Lit",{"$f":"E34*E21","v":300},null,null,"Hé",null,{"$f":"P51","v":{"v":82,"d":"82.0"}},"b"]
[null,"pression",null,200,"total L 02",{"$f":"IF(K35=100%,\"bouteille 02 !\",\"(stick ou tampon)\" )","v":"(stick ou tampon)"},{"$nulls":3},{"$f":"IF(K35=100%,\"O2\",IF(K35=21%,\"Air\",\"Nitrox\"))","v":"Nitrox"},{"v":0.4,"d":"40%"},{"$f":"P50","v":{"v":1.1578947368421364,"d":"1.2"}},"b",null,null,"restante","désirée","rajout"]
[null,"désirée",null,null,{"$f":"F26+G34","v":330},"  compresseur",{"$nulls":3},"Air",{"v":0.21,"d":"21%"},{"$f":"P52","v":{"v":16.84210526315784,"d":"16.8"}},"b",null,"Pression",{"$f":"E20","v":100},{"$f":"K21","v":200},{"$f":"Q36-P36","v":{"v":100,"d":"100.00"}}]
[null,"NOUVEAU  MELANGE",null,null,{"$f":"F27","v":150},{"$nulls":4},{"$f":"IF(K35<25%,\"Nitrox < à 25 %   !\",\"\")","v":""},{"$nulls":4},"% o2",{"$f":"D26/100","v":{"v":0.1,"d":"10%"}},{"$f":"J17/100","v":{"v":0.07,"d":"7%"}}]
[null,{"$f":"IF(D27=0,\"N\",\"T\")","v":"T"},{"$f":"D40/E41*100","v":{"v":55.00000000000001,"d":"55.0"}},{"$f":"100*D42/E41","v":{"v":25,"d":"25.0"}},{"$nulls":4}," =",{"$f":"IF(J18=0,\"N\",\"T\")","v":"T"},{"$f":"R54*100","v":{"v":7.000000000000001,"d":"7.0"}},{"$f":"IF(J18<=0,\"\",R55*100)","v":{"v":66.00000000000001,"d":"66.0"}},null,null,"% Hé",{"$f":"D27/100","v":{"v":0.5,"d":"50%"}},{"$f":"(J18/100)","v":{"v":0.66,"d":"66%"}}]
[{"$nulls":14},"% N2",{"$f":"IF(P37=0,0,IF(P38=0,1-P37,1-P37-P38))","v":{"v":0.4,"d":"40%"}},{"$f":"IF(Q37=0,0,IF(Q38=0,1-Q37,IF(Q38>0,1-Q37-Q38)))","v":{"v":0.2699999999999999,"d":"27%"}}]
[null,"total L 02 =",null,{"$f":"G34+F26","v":330},{"$nulls":10},"PP o2",{"$f":"P36*P37","v":{"v":10,"d":"10.00"}},{"$f":"Q36*Q37","v":{"v":14.000000000000002,"d":"14.00"}},{"$f":"Q40-P40","v":{"v":4.000000000000002,"d":"4.00"}}]
[null,"total L N2 =",null,{"$f":"G33+F28","v":120},{"$f":"D40+D41+D42","v":600},"litres",{"$nulls":8},"PP Hé",{"$f":"P36*P38","v":{"v":50,"d":"50.00"}},{"$f":"Q36*Q38","v":{"v":132,"d":"132.00"}},{"$f":"Q41-P41","v":{"v":82,"d":"82.00"}}]
[null,"total L Hé =",null,{"$f":"F27","v":150},{"$nulls":10},"PP N2",{"$f":"P36*P39","v":{"v":40,"d":"40.00"}},{"$f":"Q36*Q39","v":{"v":53.99999999999998,"d":"54.00"}},{"$f":"Q42-P42","v":{"v":13.999999999999979,"d":"14.00"}}]
["   Prix pratiqués",{"$nulls":3},"PRIX    remplissage  complémentaire "]
["   à la station de gonflage",{"$nulls":3}," Hé",{"v":0.0255,"d":"0.0255 €"},null,"  le litre",null,"CAPACITE ","PRIX Hé =",{"$f":"L30*E21*F44","v":{"v":6.273,"d":"6.27 €"}},null,null,"O2",{"$f":"K35","v":{"v":0.4,"d":"40%"}}]
["      L'AIR DES VASQUES DU QUERCY",{"$nulls":3},"O2",{"v":0.021,"d":"0.0210 €"},null,"  le litre",null,"BOUTEILLE","PRIX 02 =",{"$f":"L29*E21*F45","v":{"v":0.01754430379746867,"d":"0.02 €"}},null,null," N2",{"$f":"1-P44","v":{"v":0.6,"d":"60%"}},"tampon "]
["      à Gramat dans le LOT",{"$nulls":3},"AIR",{"v":2E-3,"d":"0.0020 €"},null,"  le litre",null,{"$f":"E21","v":{"v":3,"d":"3 L"}},"PRIX Air =",{"$f":"L31*E21*F46","v":{"v":0.10632911392405064,"d":"0.11 €"}}]
["      chez André GRIMAL",{"$nulls":3},"mélange initial :",null,null,{"$f":"E20","v":{"v":100,"d":"100 bars"}},null,{"$f":"IF(D27=0,\"Nitrox\",\"Trimix\")","v":"Trimix"},{"$f":"D26","v":10},{"$f":"IF(J47=\"Nitrox\",\"\",D27)","v":50},null,null,"O2",{"$f":"K36","v":{"v":0.21,"d":"21%"}}]
[{"$nulls":14}," N2",{"$f":"1-P47","v":{"v":0.79,"d":"79%"}},"compresseur"]
[{"$nulls":4},"mélange final : ",null,null,{"$f":"K21","v":{"v":200,"d":"200 bars"}},null,{"$f":"IF(J18=0,\"Nitrox\",\"Trimix\")","v":"Trimix"},{"$f":"J17","v":7},{"$f":"IF(J49=\"Nitrox\",\"\",J18)","v":66}]
[{"$nulls":14},{"$f":"\"Nitrox \"&TEXT(P44*100,0)","v":"Nitrox 40"},{"$f":"(P48*R40-P47*R42)/(P44*P48-P45*P47)","v":{"v":1.1578947368421364,"d":"1.16"}},"bars"]
[{"$nulls":4},"PRIX",{"$nulls":4},{"$f":"(L44+L45+L46)","v":{"v":6.396873417721519,"d":"6.40 €"}},null,{"$f":"+J51*6.55957","v":{"v":41.96073896468354,"d":"(42F)"}},null,null,"Hélium",{"$f":"R41","v":{"v":82,"d":"82.00"}},"bars"]
[{"$nulls":14},"compresseur",{"$f":"(P44*R42-P45*R40)/(P44*P48-P45*P47)","v":{"v":16.84210526315784,"d":"16.84"}},"bars"]
[]
[{"$nulls":14},"O2",{"$f":"P50*P44+P52*P47+P36*P37","v":{"v":14,"d":"14.00"}},"bars",{"$f":"P54/P57","v":{"v":0.07,"d":"7%"}}]
[{"$nulls":14},"He",{"$f":"P51+P36*P38","v":{"v":132,"d":"132.00"}},"bars",{"$f":"P55/P57","v":{"v":0.6600000000000001,"d":"66%"}}]
[{"$nulls":14},"N2",{"$f":"P50*P45+P52*P48+P36*P39","v":{"v":53.99999999999998,"d":"54.00"}},"bars",{"$f":"P56/P57","v":{"v":0.2699999999999999,"d":"27%"}}]
[{"$nulls":14},"Total",{"$f":"SUM(P54:P56)","v":{"v":199.99999999999997,"d":"200.00"}},"bars",{"$f":"SUM(R54:R56)","v":{"v":1,"d":"100%"}}]
[]
[{"$nulls":15},{"$f":"IF(R54=1,\"Oxygene\",IF(R55>0,\"Trimix \"&TEXT(R54*100,0)&\"/\"&TEXT(R55*100,0),\"Nitrox \"&TEXT(R54*100,0)))","v":"Trimix 7/66"}]

{"sheet":"3","index":5,"n_rows":67,"n_cols":18,"rows_kept":67,"merged":[[1,0,1,18],[2,20,2,23],[3,2,3,16],[3,20,9,21],[3,22,9,22],[3,23,9,23],[4,2,4,16],[5,6,5,7],[6,5,8,5],[8,13,8,14],[11,13,11,14],[12,13,12,14],[13,1,13,5],[15,1,15,5],[15,13,15,15],[16,1,16,5],[16,13,17,14],[16,15,17,15],[17,16,17,17],[18,13,18,17],[19,13,19,17],[20,13,20,17],[21,1,22,5],[21,13,21,17],[22,14,22,17],[23,13,24,13],[23,14,24,17],[24,7,25,12],[25,1,25,5],[25,15,26,16],[25,17,26,17],[27,14,27,15],[27,16,27,17],[29,14,30,17],[30,8,32,8],[30,9,32,9],[30,11,32,11],[31,15,32,16],[31,17,32,17],[33,14,33,17]]}
[]
["Pour les trimix, héliair, héliox,  l'alarme PPO2 s'active au delà de 1,47 ; si besoin de trimix hyperoxique ( + de 21 % d'O2 ), alors  considérer sa PPO2 comme celle d' un nitrox . "]
[]
[null,null,"REMPILAGE AVEC  FONDS DE B50, B20, OU AUTRES :"]
["JP Couloumy",null,"STICK,  TAMPON,  DEUX TRIMIX OU NITROX  DIFFERENTS..."]
[]
[{"$nulls":5},"(3)",{"$nulls":7},"O2","Hé","       PP max pour O2 et N2 :"]
[{"$nulls":8},"Je rajoute : ",0,null,"bars de      : ",{"$f":"IF(O8=0,\"N\",\"T\")","v":"T"},10,50,"           O2 = 1,47 (60m air)  et  1,62 paliers (nitrox)"]
[{"$nulls":8},"soit :",{"$f":"IF($N$8+$O$8=0,0,IF(N$8=0,0,($E$19*$J$8)-($L$9+$M$9)))","v":0},null,{"$f":"($N$8*$J$8/100)*$E$19","v":{"v":0,"d":"0.00"}},{"$f":"IF($N$8=0,0,($O$8*$J$8/100)*$E$19)","v":0},{"$f":"IF(M8=\"T\",\"\",IF(N8<21,\"ERREUR !\",\"\"))","v":""},null,"           N2 = 5,53 ( 60m air )"]
[{"$nulls":13},"O2","Hé"]
[{"$nulls":8},"Je rajoute : ",10,null,"bars de      : ",{"$f":"IF(O11=0,\"N\",\"T\")","v":"N"},30,0]
[{"$nulls":8},"soit :",{"$f":"IF($N$11+$O$11=0,0,IF(N$11=0,0,($E$19*$J$11)-($L$12+$M$12)))","v":126},null,{"$f":"($N$11*$J$11/100)*$E$19","v":{"v":54,"d":"54.00"}},{"$f":"IF($N$11=0,0,($O$11*$J$11/100)*$E$19)","v":0},{"$f":"IF(M11=\"T\",\"\",IF(N11<21,\"ERREUR !\",\"\"))","v":""}]
[{"$nulls":8},"Je rajoute : ",50,null,"bars d' 02"]
[null,"(1)  RESTE dans la BOUTEILLE",{"$nulls":6},"soit :",{"$f":"J13*E19","v":900},null,"litres d' 02"]
[]
[null,"de PLONGEE :",{"$nulls":6},"Je rajoute : ",100,null,"bars d'hélium",null,{"$f":"IF(N17>220,\"Pression élevée !\",\"pression finale\")","v":"pression finale"}]
[{"$nulls":8},"soit :",{"$f":"J16*E19","v":1800},null,"litres d'hélium",null,{"$f":"J11+J13+J16+J18+E18+J8","v":210},null,{"$f":"IF(N17=1,\"bar\",\"bars\")","v":"bars"}]
[null,null,"pression restante",null,50,"bars",null,null,"Je rajoute : ",0,null,"bars d'air",{"$nulls":4},"ZONE   DANGER"]
[null,null,"capacité bouteille",null,18,"litres",null,null,"soit : ",{"$f":"J18*E19","v":0},null,"litres d'air ",null,{"$f":"IF(P29<0.19,\"HYPOXIE   !!!!!! \",\"\")","v":""}]
[{"$nulls":8},"donc :",{"$f":"(21/100*J19)","v":0},null,"litres 02",null,{"$f":"IF(J28>0,\"\",IF(P29>1.62,\"HYPEROXIE  !!!!! \",\"\"))","v":""}]
[{"$nulls":3},"litres total   =",{"$f":"E19*E18","v":900},"litres",{"$nulls":3},{"$f":"79/100*J19","v":0},null,"litres N2",null,{"$f":"IF(J28=0,\"\",IF(P29>1.47,\"HYPEROXIE  !!!!! \",\"\"))","v":"HYPEROXIE  !!!!! "}]
[{"$nulls":8},"et :",{"$f":"J17+F28","v":1800},null,"litres d'hélium",null,{"$f":"IF(R29>5.53,\"NARCOSE  !!!!!\",\"\")","v":""}]
[{"$nulls":11},"j'ai donc au total ( après rajout O2, Air, Hé, ou Trimix )",{"$f":"E21+J19+J17+J14+J12+L12+M12+J9+L9+M9","v":{"v":3780,"d":"3780.0"}},"litres","entrer la profondeur : plongée ou palier"]
[{"$nulls":13},"(4)",{"$f":"IF(J28>0,\"PROF.  TRIMIX\",\"PROF.  NITROX\")","v":"PROF.  TRIMIX"}]
[{"$nulls":7},{"$f":"IF(J27<0,\"IMPOSSIBLE !\",IF(J28<0,\"IMPOSSIBLE !\",IF(J29<0,\"IMPOSSIBLE !\",\"NOUVEAU  MELANGE\")))","v":"NOUVEAU  MELANGE"}]
[null,"(2)  % MELANGE RESTANT",{"$nulls":13},140,null,"m"]
[null,null,"% O2  =",21,"L d' 02 =",{"$f":"D27/100*E21","v":189},null,null," %   O2   =",{"$f":"(F27+J14+J20+L12+L9)/M23*100","v":{"v":30.238095238095237,"d":"30.24"}},null,"%"]
[null,null,"% Hé  =",0,"L d' Hé =",{"$f":"D28/100*E21","v":0},null,null," %   Hé   =",{"$f":"(F28+J17+M12+M9)/M23*100","v":{"v":47.61904761904761,"d":"47.62"}},null,"%",null,null,{"$f":"IF(O24=\"PROF.  TRIMIX\",\"( Max O2  = 1,47 )\",IF(O24=\"PROF.  NITROX\",\"( Max O2  = 1,62 )\"))","v":"( Max O2  = 1,47 )"},null,{"$f":"IF(O24=\"TRIMIX\",\"( Max  = 5,53 )\",\"\")","v":""}]
[null,null,"% N2  =",{"$f":"IF(D27=0,\"0\",IF(D28=0,100-D27,IF(D28>0,100-(D27+D28))))","v":79},"L d' N2 =",{"$f":"D29/100*E21","v":711},null,null," %   N2   =",{"$f":"(F29+J21+J12+J9)/M23*100","v":{"v":22.142857142857142,"d":"22.14"}},null,"%",null,null,"PP 02 =",{"$f":"((P26/10)+1)*J27/100","v":{"v":4.535714285714286,"d":"4.54"}}," PP N2 =",{"$f":"((P26/10)+1)*J29/100","v":{"v":3.321428571428571,"d":"3.32"}}]
[null,null,"TOTAL",{"$f":"D27+D28+D29","v":100},"TOTAL",{"$f":"(F27+F28+F29)","v":900},null,null,"  %    total       =",{"$f":"SUM(J27:J29)","v":{"v":99.99999999999999,"d":"100.00"}},{"$nulls":4},{"$f":"IF(J28=0,\"PeA\",\"PNe\")","v":"PNe"}]
[{"$nulls":8},{"$f":"IF(J28=0,\" = N\",\"= T\")","v":"= T"},{"$f":"J27","v":{"v":30.238095238095237,"d":"30.2"}},null,{"$f":"IF(J28=0,\"\",J28)","v":{"v":47.61904761904761,"d":"47.6"}}]
[{"$nulls":15},{"$f":"IF(R29<0.79,\"O\",(10*R29)/0.79-7.9/0.79)","v":{"v":32.04339963833634,"d":"32"}},null,"m"]
[]
[]
[]
[{"$nulls":9},"mémo",{"$nulls":5},8]
[]
[]
[]
[]
[]
[{"$nulls":8},"ESPACE LIBRE POUR VOS NOTES"]
[{"$nulls":11},"hjbvcvcfbxfx"]
{"$rows_empty":19}
[0]
[]
[]
[]
[{"$nulls":5},0]

{"sheet":"5","index":6,"n_rows":65,"n_cols":13,"rows_kept":65,"merged":[[1,2,2,12],[3,2,3,3],[3,5,3,6],[4,2,5,2],[4,3,5,3],[4,5,5,6],[4,7,5,7],[4,9,5,10],[4,11,5,11],[4,12,5,12],[6,6,6,7],[6,11,6,12],[7,6,7,7],[7,9,9,9],[7,10,9,10],[7,11,9,12],[8,6,8,7],[9,6,9,7],[10,6,10,7],[11,6,11,7],[11,9,12,10],[12,6,12,7],[13,6,13,7],[13,11,13,12],[14,6,14,7],[14,11,19,12],[15,6,15,7],[16,6,16,7],[17,6,17,7],[18,6,18,7],[19,6,19,7],[22,4,23,4],[22,5,23,5],[22,7,23,7],[24,6,24,7],[25,6,25,7],[26,6,26,7],[27,6,27,7],[28,6,28,7],[29,6,29,7],[30,6,30,7],[31,6,31,7],[32,6,32,7],[33,6,33,7],[34,6,34,7],[35,6,35,7],[36,6,36,7],[37,6,37,7],[38,6,38,7],[39,6,39,7],[40,6,40,7],[41,6,41,7],[42,6,42,7],[43,6,43,7],[44,6,44,7],[45,6,45,7],[46,6,46,7],[47,6,47,7],[48,6,48,7],[49,6,49,7],[50,6,50,7],[51,6,51,7],[52,6,52,7],[53,6,53,7],[54,6,54,7],[55,6,55,7],[56,6,56,7],[57,6,57,7],[58,6,58,7],[59,6,59,7],[60,6,60,7],[61,6,61,7],[62,6,62,7],[63,6,63,7],[64,6,64,7]]}
[]
[null,null,"Fabrication Nitrox   et    Prof. équivalente Air"]
[]
[null,"JP Couloumy","nitrox désiré",null,null,"pression désirée"]
[null,null,{"$f":"IF(D5=21,\"Air\",\"N\")","v":"N"},30,null,220,null,"Bars",null,"    FABRICATION ",null,{"$f":"C5","v":"N"},{"$f":"D5","v":30}]
[]
[null,null,"Pression","Prof. Réelle","PP O2","PP N2","PeA",null,null," bars d' 02","bars d' AIR","TOTAL "]
[null,null,{"$f":"(D8+10)/10","v":1.9},9,{"$f":"C8*D5%","v":0.57},{"$f":"C8*(100-D5)%","v":{"v":1.3299999999999998,"d":"1.33"}},{"$f":"IF(E8>1.61,\"Hyperoxie\",((10*F8)/0.79)-(7.9/0.79))","v":{"v":6.835443037974681,"d":"7 m"}},null,null,{"$f":"((F5*D5)/100)-(((21/79)*F5*(100-D5)))/100","v":{"v":25.063291139240512,"d":"25.1"}},{"$f":"((F5*(100-D5)/100)+((21/79)*((F5*(100-D5)/100))))","v":{"v":194.9367088607595,"d":"194.9"}},{"$f":"K8+J8","v":{"v":220,"d":"220.0"}}]
[null,null,{"$f":"(D9+10)/10","v":2.2},12,{"$f":"C9*D5%","v":0.66},{"$f":"C9*(100-D5)%","v":1.54},{"$f":"IF(E9>1.61,\"Hyperoxie\",((10*F9)/0.79)-(7.9/0.79))","v":{"v":9.49367088607595,"d":"9 m"}}]
[null,null,2.5,15,{"$f":"C10*D5%","v":0.75},{"$f":"C10*(100-D5)%","v":1.75},{"v":12.151898734177212,"d":"12 m"}]
[null,null,2.8,18,{"$f":"C11*D5%","v":0.84},{"$f":"C11*(100-D5)%","v":{"v":1.9599999999999997,"d":"1.96"}},{"v":14.810126582278478,"d":"15 m"}]
[null,null,3.1,21,{"$f":"C12*D5%","v":{"v":0.9299999999999999,"d":"0.93"}},{"$f":"C12*(100-D5)%","v":2.17},{"v":17.468354430379744,"d":"17 m"},null,null,{"$f":"IF(F5>220,\"PRESSION  ELEVEE  !\",\"\")","v":""}]
[null,null,3.4,24,{"$f":"C13*D5%","v":1.02},{"$f":"C13*(100-D5)%","v":2.38},{"v":20.126582278481006,"d":"20 m"}]
[null,null,3.7,27,{"$f":"C14*D5%","v":1.11},{"$f":"C14*(100-D5)%","v":2.59},{"v":22.784810126582272,"d":"23 m"}]
[null,null,4,30,{"$f":"C15*D5%","v":{"v":1.2,"d":"1.20"}},{"$f":"C15*(100-D5)%","v":{"v":2.8,"d":"2.80"}},{"v":25.44303797468354,"d":"25 m"},{"$nulls":3},"Profondeurs "]
[null,null,4.3,33,{"$f":"C16*D5%","v":{"v":1.2899999999999998,"d":"1.29"}},{"$f":"C16*(100-D5)%","v":3.01},{"v":28.101265822784804,"d":"28 m"},{"$nulls":3},"intermédiaires"]
[null,null,4.6,36,{"$f":"C17*D5%","v":1.38},{"$f":"C17*(100-D5)%","v":{"v":3.2199999999999998,"d":"3.22"}},{"v":30.759493670886066,"d":"31 m"}]
[null,null,4.9,39,{"$f":"C18*D5%","v":1.47},{"$f":"C18*(100-D5)%","v":3.43},{"v":33.41772151898734,"d":"33 m"}]
[null,null,5.2,42,{"$f":"C19*D5%","v":1.56},{"$f":"C19*(100-D5)%","v":{"v":3.6399999999999997,"d":"3.64"}},{"v":36.075949367088604,"d":"36 m"}]
[null,null,{"$f":"(D20+10)/10","v":5.5},45,{"$f":"C20*D5%","v":1.65},{"$f":"C20*(100-D5)%","v":{"v":3.8499999999999996,"d":"3.85"}},"Hyperoxie"]
[]
[]
[{"$nulls":4},{"$f":"C5","v":"N"},{"$f":"D5","v":30}]
[]
[null,null,"Pression","Prof. Réelle","PP O2","PP N2","PeA"]
[null,null,{"$f":"(D26+10)/10","v":1.6},6,{"$f":"C26*F23%","v":0.48},{"$f":"C26*(100-F23)%","v":{"v":1.1199999999999999,"d":"1.12"}},{"$f":"IF(E26>1.61,\"Hyperoxie\",((10*F26)/0.79)-(7.9/0.79))","v":{"v":4.177215189873417,"d":"4 m"}}]
[null,null,{"$f":"(D27+10)/10","v":1.7},7,{"$f":"C27*F23%","v":0.51},{"$f":"C27*(100-F23)%","v":1.19},{"$f":"IF(E27>1.61,\"Hyperoxie\",((10*F27)/0.79)-(7.9/0.79))","v":{"v":5.063291139240503,"d":"5 m"}}]
[null,null,1.8,8,{"$f":"C28*F23%","v":0.54},{"$f":"C28*(100-F23)%","v":1.26},{"v":5.949367088607593,"d":"6 m"}]
[null,null,1.9,9,{"$f":"C29*F23%","v":0.57},{"$f":"C29*(100-F23)%","v":{"v":1.3299999999999998,"d":"1.33"}},{"v":6.835443037974681,"d":"7 m"}]
[null,null,2,10,{"$f":"C30*F23%","v":{"v":0.6,"d":"0.60"}},{"$f":"C30*(100-F23)%","v":{"v":1.4,"d":"1.40"}},{"v":7.721518987341771,"d":"8 m"}]
[null,null,2.1,11,{"$f":"C31*F23%","v":0.63},{"$f":"C31*(100-F23)%","v":1.47},{"v":8.60759493670886,"d":"9 m"}]
[null,null,2.2,12,{"$f":"C32*F23%","v":0.66},{"$f":"C32*(100-F23)%","v":1.54},{"v":9.49367088607595,"d":"9 m"}]
[null,null,2.3,13,{"$f":"C33*F23%","v":0.69},{"$f":"C33*(100-F23)%","v":{"v":1.6099999999999999,"d":"1.61"}},{"v":10.379746835443033,"d":"10 m"}]
[null,null,2.4,14,{"$f":"C34*F23%","v":0.72},{"$f":"C34*(100-F23)%","v":1.68},{"v":11.265822784810126,"d":"11 m"}]
[null,null,2.5,15,{"$f":"C35*F23%","v":0.75},{"$f":"C35*(100-F23)%","v":1.75},{"v":12.151898734177212,"d":"12 m"}]
[null,null,2.6,16,{"$f":"C36*F23%","v":0.78},{"$f":"C36*(100-F23)%","v":{"v":1.8199999999999998,"d":"1.82"}},{"v":13.037974683544302,"d":"13 m"}]
[null,null,2.7,17,{"$f":"C37*F23%","v":0.81},{"$f":"C37*(100-F23)%","v":1.89},{"v":13.924050632911388,"d":"14 m"}]
[null,null,2.8,18,{"$f":"C38*F23%","v":0.84},{"$f":"C38*(100-F23)%","v":{"v":1.9599999999999997,"d":"1.96"}},{"v":14.810126582278478,"d":"15 m"}]
[null,null,2.9,19,{"$f":"C39*F23%","v":0.87},{"$f":"C39*(100-F23)%","v":2.03},{"v":15.696202531645564,"d":"16 m"}]
[null,null,3,20,{"$f":"C40*F23%","v":{"v":0.8999999999999999,"d":"0.90"}},{"$f":"C40*(100-F23)%","v":{"v":2.0999999999999996,"d":"2.10"}},{"v":16.582278481012654,"d":"17 m"}]
[null,null,3.1,21,{"$f":"C41*F23%","v":{"v":0.9299999999999999,"d":"0.93"}},{"$f":"C41*(100-F23)%","v":2.17},{"v":17.468354430379744,"d":"17 m"}]
[null,null,3.2,22,{"$f":"C42*F23%","v":0.96},{"$f":"C42*(100-F23)%","v":{"v":2.2399999999999998,"d":"2.24"}},{"v":18.354430379746834,"d":"18 m"}]
[null,null,3.3,23,{"$f":"C43*F23%","v":{"v":0.9899999999999999,"d":"0.99"}},{"$f":"C43*(100-F23)%","v":{"v":2.3099999999999996,"d":"2.31"}},{"v":19.240506329113916,"d":"19 m"}]
[null,null,3.4,24,{"$f":"C44*F23%","v":1.02},{"$f":"C44*(100-F23)%","v":2.38},{"v":20.126582278481006,"d":"20 m"}]
[null,null,3.5,25,{"$f":"C45*F23%","v":1.05},{"$f":"C45*(100-F23)%","v":{"v":2.4499999999999997,"d":"2.45"}},{"v":21.012658227848096,"d":"21 m"}]
[null,null,3.6,26,{"$f":"C46*F23%","v":1.08},{"$f":"C46*(100-F23)%","v":2.52},{"v":21.898734177215186,"d":"22 m"}]
[null,null,3.7,27,{"$f":"C47*F23%","v":1.11},{"$f":"C47*(100-F23)%","v":2.59},{"v":22.784810126582272,"d":"23 m"}]
[null,null,3.8,28,{"$f":"C48*F23%","v":1.14},{"$f":"C48*(100-F23)%","v":{"v":2.6599999999999997,"d":"2.66"}},{"v":23.670886075949362,"d":"24 m"}]
[null,null,3.9,29,{"$f":"C49*F23%","v":1.17},{"$f":"C49*(100-F23)%","v":2.73},{"v":24.55696202531645,"d":"25 m"}]
[null,null,4,30,{"$f":"C50*F23%","v":{"v":1.2,"d":"1.20"}},{"$f":"C50*(100-F23)%","v":{"v":2.8,"d":"2.80"}},{"v":25.44303797468354,"d":"25 m"}]
[null,null,4.1,31,{"$f":"C51*F23%","v":{"v":1.2299999999999998,"d":"1.23"}},{"$f":"C51*(100-F23)%","v":{"v":2.8699999999999997,"d":"2.87"}},{"v":26.329113924050624,"d":"26 m"}]
[null,null,4.2,32,{"$f":"C52*F23%","v":1.26},{"$f":"C52*(100-F23)%","v":2.94},{"v":27.21518987341772,"d":"27 m"}]
[null,null,4.3,33,{"$f":"C53*F23%","v":{"v":1.2899999999999998,"d":"1.29"}},{"$f":"C53*(100-F23)%","v":3.01},{"v":28.101265822784804,"d":"28 m"}]
[null,null,4.4,34,{"$f":"C54*F23%","v":1.32},{"$f":"C54*(100-F23)%","v":3.08},{"v":28.9873417721519,"d":"29 m"}]
[null,null,4.5,35,{"$f":"C55*F23%","v":{"v":1.3499999999999999,"d":"1.35"}},{"$f":"C55*(100-F23)%","v":3.15},{"v":29.873417721518983,"d":"30 m"}]
[null,null,4.6,36,{"$f":"C56*F23%","v":1.38},{"$f":"C56*(100-F23)%","v":{"v":3.2199999999999998,"d":"3.22"}},{"v":30.759493670886066,"d":"31 m"}]
[null,null,4.7,37,{"$f":"C57*F23%","v":1.41},{"$f":"C57*(100-F23)%","v":3.29},{"v":31.645569620253163,"d":"32 m"}]
[null,null,4.8,38,{"$f":"C58*F23%","v":1.44},{"$f":"C58*(100-F23)%","v":3.36},{"v":32.53164556962025,"d":"33 m"}]
[null,null,4.9,39,{"$f":"C59*F23%","v":1.47},{"$f":"C59*(100-F23)%","v":3.43},{"v":33.41772151898734,"d":"33 m"}]
[null,null,5,40,{"$f":"C60*F23%","v":{"v":1.5,"d":"1.50"}},{"$f":"C60*(100-F23)%","v":{"v":3.5,"d":"3.50"}},{"v":34.303797468354425,"d":"34 m"}]
[null,null,5.1,41,{"$f":"C61*F23%","v":{"v":1.5299999999999998,"d":"1.53"}},{"$f":"C61*(100-F23)%","v":{"v":3.5699999999999994,"d":"3.57"}},{"v":35.189873417721515,"d":"35 m"}]
[null,null,5.2,42,{"$f":"C62*F23%","v":1.56},{"$f":"C62*(100-F23)%","v":{"v":3.6399999999999997,"d":"3.64"}},{"v":36.075949367088604,"d":"36 m"}]
[null,null,5.3,43,{"$f":"C63*F23%","v":{"v":1.5899999999999999,"d":"1.59"}},{"$f":"C63*(100-F23)%","v":{"v":3.7099999999999995,"d":"3.71"}},{"v":36.96202531645569,"d":"37 m"}]
[null,null,5.4,44,{"$f":"C64*F23%","v":1.62},{"$f":"C64*(100-F23)%","v":3.78},"Hyperoxie"]
[null,null,5.5,45,{"$f":"C65*F23%","v":1.65},{"$f":"C65*(100-F23)%","v":{"v":3.8499999999999996,"d":"3.85"}},"Hyperoxie"]

{"sheet":"6","index":7,"n_rows":32,"n_cols":16,"rows_kept":32,"merged":[[0,2,0,3],[0,4,1,12],[1,0,1,1],[3,15,5,15],[7,4,7,5],[7,10,7,15],[8,12,8,13],[9,10,9,15],[10,12,10,13],[11,10,11,14],[14,3,15,3],[14,4,15,4],[14,11,14,13],[14,14,14,15],[15,6,15,8],[15,14,15,15],[16,14,16,15],[17,1,17,2],[17,3,18,3],[17,8,18,8],[17,14,17,15],[18,1,18,2],[18,14,18,15],[19,1,20,4],[19,11,19,14],[20,13,20,14],[21,1,21,2],[21,10,21,15],[22,1,22,4],[22,6,22,7],[22,14,22,15],[23,6,23,8],[23,10,23,15],[24,6,24,8]]}
[{"$nulls":4},"AUTONOMIE  et  DISTANCE"]
["JP Couloumy"]
[]
[{"$nulls":15},{"$f":"G23","v":{"v":2903.514376996805,"d":"2,904L"}}]
[]
[]
[]
[{"$nulls":10},"et une conso surface  de :"]
[null," Température à chaud =",null,null,40,"°","Pression",200,"bars",{"$nulls":3},28,null,"L / mn"]
[{"$nulls":10},"à une profondeur de :"]
[null," Température à froid    =",null,null,11,"°","Pression",{"$f":"H9*(273+E11)/(273+E9)","v":{"v":181.4696485623003,"d":"181"}},"bars",{"$nulls":3},26,null,"m"]
[]
[{"$nulls":12},"et une vitesse de :"]
[]
[{"$nulls":3},"1 /",3,null,null,{"$f":"E15","v":3},{"$nulls":3},"palme",null,null,"scooter"]
[{"$nulls":6},"avec  BI, TRI, QUADRI, RELAIS",{"$nulls":3},16,18,20,22,40]
[{"$nulls":7},"départ",null,null,"m/mn","m/mn","m/mn","m/mn","m/mn"]
[null,"BARS",null,{"$f":"H11","v":{"v":181.4696485623003,"d":"181"}},null,null," nombre de ",{"$f":"D18","v":{"v":181.4696485623003,"d":"181 bars"}},"capacités",null,{"$f":"($G23/((M9*($M11+10))/10))*K16","v":{"v":460.8752979360008,"d":"461"}},{"$f":"($G23/((M9*($M11+10))/10))*L16","v":{"v":518.4847101780009,"d":"518"}},{"$f":"($G23/((M9*($M11+10))/10))*M16","v":{"v":576.094122420001,"d":"576"}},{"$f":"($G23/((M9*($M11+10))/10))*N16","v":{"v":633.7035346620011,"d":"634"}},{"$f":"($G23/((M9*($M11+10))/10))*O16","v":{"v":1152.188244840002,"d":"1152"}}]
[null,"bouteille pleine",{"$nulls":4},"bouteilles",{"$nulls":3},"m","m","m","m","m"]
[null,{"$f":"IF(E15<3,\"REGLE DES 1/3, 1/4, 1/5  ?\",IF(E15>5,\"REGLE DES 1/3, 1/4, 1/5  ?\",\"\"))","v":""},{"$nulls":4},4,"X",12,null,null,"Temps aller ="]
[{"$nulls":6},0,"X",0,{"$nulls":3},{"$f":"K18/15","v":{"v":30.725019862400053,"d":"31"}},"mn"]
[null,"RETOUR  A",null,{"$f":"IF(E15=3,D18*2/3,IF(E15=4,D18*3/4,IF(E15=5,D18*4/5,\"\")))","v":{"v":120.9797657082002,"d":"121"}},"Bars",null,null,"X",null,null,"DISTANCE  TOTALE  SI  TRAVERSEE"]
[null,"( SUR CHAQUE BOUTEILLE )",{"$nulls":4},{"$f":"((D18-D22)*I20*G20)+((D18-D22)*I21*G21)+((D18-D22)*I22*G22)","v":{"v":2903.514376996805,"d":"2904"}},null,"litres",null,{"$f":"K18*2","v":{"v":921.7505958720016,"d":"922 m"}},{"$f":"L18*2","v":{"v":1036.9694203560018,"d":"1,037 m"}},{"$f":"M18*2","v":{"v":1152.188244840002,"d":"1,152 m"}},{"$f":"N18*2","v":{"v":1267.4070693240021,"d":"1,267 m"}},{"$f":"O18*2","v":{"v":2304.376489680004,"d":"2,304 m"}}]
[{"$nulls":10},"Temps total si traversée ( genre Cabouy/ Poumeyssen )"]
[{"$nulls":12},{"$f":"+M21*2","v":{"v":61.45003972480011,"d":"61"}},"mn"]
[]
[{"$nulls":7},"mémo"]
[]
[]
[]
[]
[{"$nulls":6},"ESPACE LIBRE POUR VOS NOTES"]

{"sheet":"6bis","index":8,"n_rows":162,"n_cols":17,"rows_kept":162,"merged":[[0,4,1,9],[2,4,2,9],[3,4,3,9],[4,7,4,8],[5,4,5,7],[6,5,6,8],[7,5,7,8],[8,5,9,6],[8,7,9,7],[8,8,9,8],[9,2,9,3],[9,11,9,14],[10,0,10,1],[10,11,10,14],[18,1,18,3],[19,10,22,17],[36,1,36,3],[37,10,40,17],[54,1,54,3],[55,10,58,17],[72,1,72,3],[73,10,76,17],[90,1,90,3],[91,10,94,17],[109,1,109,3],[109,10,112,17],[126,1,126,3],[127,10,130,17],[144,1,144,3],[145,10,148,17]]}
[{"$nulls":4},"MULTI PROFONDEURS (6 bis)"]
[{"$nulls":10},"   Pour prévoir l'autonomie sur une plongée  multi profondeurs,"]
[{"$nulls":4},"Profil du trajet ALLER",{"$nulls":5},"   vous devez connaître le profil ( temps passé à chaque profondeur )."]
[{"$nulls":4},"Vous avez programmé  :",{"$nulls":5},"   Entrez donc chaque temps à chaque profondeur, pour savoir si vous avez "]
[{"$nulls":4},"régle  1 / ",{"$f":"'6'!E15","v":3},"et ","    conso surface ",null,{"$f":"'6'!M9","v":{"v":28,"d":"28Lmn"}},"   prévu suffisamment  de bouteilles."]
[{"$nulls":4},"  gaz disponible pour l'aller",{"$nulls":3},{"$f":"'6'!G23","v":{"v":2903.514376996805,"d":"2904"}},"Litres","   Si votre autonomie est dépassée, une alarme apparaîtra !"]
[{"$nulls":5},"entrer le temps passé ",{"$nulls":4},"   si besoin, réajustez les bouteilles dans le tableau précédent  "]
[{"$nulls":5},"aux profondeurs principales",{"$nulls":4},"   ou réduisez le dernier temps dans celui-ci . ( donc la distance ! )"]
[{"$nulls":5},"prof.",null,"temps",{"$f":"H162","v":0}]
[null,null,"Faire défiler le tableau",{"$nulls":8},"exemple"]
[{"$nulls":4},1,0,"m",null,{"$f":"IF($J$162>$I$6,\"stop !\",\"mn\")","v":"mn"},{"$f":"'6bis'!$J$5*E11*H11","v":{"v":0,"d":"0Lmn"}},null,"     profil multi profondeurs :"]
[{"$nulls":4},1.2,2,"m",null,"mn",{"$f":"'6bis'!$J$5*E12*H12","v":{"v":0,"d":"0Lmn"}},null,6,"m",2,"mn"]
[{"$nulls":4},1.4,4,"m",null,"mn",{"$f":"'6bis'!$J$5*E13*H13","v":{"v":0,"d":"0Lmn"}},null,18,"m","3+2=5","mn"]
[{"$nulls":4},1.6,6,"m",null,"mn",{"$f":"'6bis'!$J$5*E14*H14","v":{"v":0,"d":"0Lmn"}},null,20,"m",null,"mn"]
[{"$nulls":4},1.8,8,"m",null,"mn",{"$f":"'6bis'!$J$5*E15*H15","v":{"v":0,"d":"0Lmn"}},null,30,"m",10,"mn"]
[{"$nulls":4},2,10,"m",null,"mn",{"$f":"'6bis'!$J$5*E16*H16","v":{"v":0,"d":"0Lmn"}},null,32,"m",null,"mn"]
[{"$nulls":4},2.2,12,"m",null,"mn",{"$f":"'6bis'!$J$5*E17*H17","v":{"v":0,"d":"0Lmn"}},null,46,"m",6,"mn"]
[{"$nulls":4},2.4,14,"m",null,"mn",{"$f":"'6bis'!$J$5*E18*H18","v":{"v":0,"d":"0Lmn"}},null,60,"m",5,"mn"]
[null,"trajet aller",null,null,2.6,16,"m",null,"mn",{"$f":"'6bis'!$J$5*E19*H19","v":{"v":0,"d":"0Lmn"}},{"$nulls":6},"retour"]
[null,"gaz disponible",null,{"$f":"$I$6","v":{"v":2903.514376996805,"d":"2,904L"}},2.8,18,"m",null,"mn",{"$f":"'6bis'!$J$5*E20*H20","v":{"v":0,"d":"0Lmn"}},{"$f":"IF($J$162>$I$6,\"AUTONOMIE  DEPASSEE !\",\"\")","v":""}]
[null,"gaz consommé",null,{"$f":"$J$162","v":{"v":0,"d":"0L"}},3,20,"m",null,"mn",{"$f":"'6bis'!$J$5*E21*H21","v":{"v":0,"d":"0Lmn"}}]
[null,"temps aller ",null,{"$f":"$H$162","v":{"v":0,"d":"0mn"}},3.2,22,"m",null,"mn",{"$f":"'6bis'!$J$5*E22*H22","v":{"v":0,"d":"0Lmn"}}]
[{"$nulls":4},3.4,24,"m",null,"mn",{"$f":"'6bis'!$J$5*E23*H23","v":{"v":0,"d":"0Lmn"}}]
[{"$nulls":4},3.6,26,"m",null,"mn",{"$f":"'6bis'!$J$5*E24*H24","v":{"v":0,"d":"0Lmn"}}]
[{"$nulls":4},3.8,28,"m",null,"mn",{"$f":"'6bis'!$J$5*E25*H25","v":{"v":0,"d":"0Lmn"}}]
[{"$nulls":4},4,30,"m",null,"mn",{"$f":"'6bis'!$J$5*E26*H26","v":{"v":0,"d":"0Lmn"}}]
[{"$nulls":4},4.2,32,"m",null,"mn",{"$f":"'6bis'!$J$5*E27*H27","v":{"v":0,"d":"0Lmn"}}]
[{"$nulls":4},4.4,34,"m",null,"mn",{"$f":"'6bis'!$J$5*E28*H28","v":{"v":0,"d":"0Lmn"}}]
[{"$nulls":4},4.6,36,"m",null,"mn",{"$f":"'6bis'!$J$5*E29*H29","v":{"v":0,"d":"0Lmn"}}]
[{"$nulls":4},4.8,38,"m",null,"mn",{"$f":"'6bis'!$J$5*E30*H30","v":{"v":0,"d":"0Lmn"}}]
[{"$nulls":4},5,40,"m",null,"mn",{"$f":"'6bis'!$J$5*E31*H31","v":{"v":0,"d":"0Lmn"}}]
[{"$nulls":4},5.2,42,"m",null,"mn",{"$f":"'6bis'!$J$5*E32*H32","v":{"v":0,"d":"0Lmn"}}]
[{"$nulls":4},5.4,44,"m",null,"mn",{"$f":"'6bis'!$J$5*E33*H33","v":{"v":0,"d":"0Lmn"}}]
[{"$nulls":4},5.6,46,"m",null,"mn",{"$f":"'6bis'!$J$5*E34*H34","v":{"v":0,"d":"0Lmn"}}]
[{"$nulls":4},5.8,48,"m",null,"mn",{"$f":"'6bis'!$J$5*E35*H35","v":{"v":0,"d":"0Lmn"}}]
[{"$nulls":4},6,50,"m",null,"mn",{"$f":"'6bis'!$J$5*E36*H36","v":{"v":0,"d":"0Lmn"}}]
[null,"trajet aller",null,null,6.2,52,"m",null,"mn",{"$f":"'6bis'!$J$5*E37*H37","v":{"v":0,"d":"0Lmn"}}]
[null,"gaz disponible",null,{"$f":"$I$6","v":{"v":2903.514376996805,"d":"2,904L"}},6.4,54,"m",null,"mn",{"$f":"'6bis'!$J$5*E38*H38","v":{"v":0,"d":"0Lmn"}},{"$f":"IF($J$162>$I$6,\"AUTONOMIE  DEPASSEE !\",\"\")","v":""}]
[null,"gaz consommé",null,{"$f":"$J$162","v":{"v":0,"d":"0L"}},6.6,56,"m",null,"mn",{"$f":"'6bis'!$J$5*E39*H39","v":{"v":0,"d":"0Lmn"}}]
[null,"temps aller ",null,{"$f":"$H$162","v":{"v":0,"d":"0mn"}},6.8,58,"m",null,"mn",{"$f":"'6bis'!$J$5*E40*H40","v":{"v":0,"d":"0Lmn"}}]
[{"$nulls":4},7,60,"m",null,"mn",{"$f":"'6bis'!$J$5*E41*H41","v":{"v":0,"d":"0Lmn"}}]
[{"$nulls":4},7.2,62,"m",null,"mn",{"$f":"'6bis'!$J$5*E42*H42","v":{"v":0,"d":"0Lmn"}}]
[{"$nulls":4},7.4,64,"m",null,{"$f":"IF($J$162>$I$6,\"stop !\",\"mn\")","v":"mn"},{"$f":"'6bis'!$J$5*E43*H43","v":{"v":0,"d":"0Lmn"}}]
[{"$nulls":4},7.6,66,"m",null,"mn",{"$f":"'6bis'!$J$5*E44*H44","v":{"v":0,"d":"0Lmn"}}]
[{"$nulls":4},7.8,68,"m",null,"mn",{"$f":"'6bis'!$J$5*E45*H45","v":{"v":0,"d":"0Lmn"}}]
[{"$nulls":4},8,70,"m",null,"mn",{"$f":"'6bis'!$J$5*E46*H46","v":{"v":0,"d":"0Lmn"}}]
[{"$nulls":4},8.2,72,"m",null,"mn",{"$f":"'6bis'!$J$5*E47*H47","v":{"v":0,"d":"0Lmn"}}]
[{"$nulls":4},8.4,74,"m",null,"mn",{"$f":"'6bis'!$J$5*E48*H48","v":{"v":0,"d":"0Lmn"}}]
[{"$nulls":4},8.6,76,"m",null,"mn",{"$f":"'6bis'!$J$5*E49*H49","v":{"v":0,"d":"0Lmn"}}]
[{"$nulls":4},8.8,78,"m",null,"mn",{"$f":"'6bis'!$J$5*E50*H50","v":{"v":0,"d":"0Lmn"}}]
[{"$nulls":4},9,80,"m",null,"mn",{"$f":"'6bis'!$J$5*E51*H51","v":{"v":0,"d":"0Lmn"}}]
[{"$nulls":4},9.2,82,"m",null,"mn",{"$f":"'6bis'!$J$5*E52*H52","v":{"v":0,"d":"0Lmn"}}]
[{"$nulls":4},9.4,84,"m",null,"mn",{"$f":"'6bis'!$J$5*E53*H53","v":{"v":0,"d":"0Lmn"}}]
[{"$nulls":4},9.6,86,"m",null,"mn",{"$f":"'6bis'!$J$5*E54*H54","v":{"v":0,"d":"0Lmn"}}]
[null,"trajet aller",null,null,9.8,88,"m",null,"mn",{"$f":"'6bis'!$J$5*E55*H55","v":{"v":0,"d":"0Lmn"}}]
[null,"gaz disponible",null,{"$f":"$I$6","v":{"v":2903.514376996805,"d":"2,904L"}},10,90,"m",null,"mn",{"$f":"'6bis'!$J$5*E56*H56","v":{"v":0,"d":"0Lmn"}},{"$f":"IF($J$162>$I$6,\"AUTONOMIE  DEPASSEE !\",\"\")","v":""}]
[null,"gaz consommé",null,{"$f":"$J$162","v":{"v":0,"d":"0L"}},10.2,92,"m",null,"mn",{"$f":"'6bis'!$J$5*E57*H57","v":{"v":0,"d":"0Lmn"}}]
[null,"temps aller ",null,{"$f":"$H$162","v":{"v":0,"d":"0mn"}},10.4,94,"m",null,"mn",{"$f":"'6bis'!$J$5*E58*H58","v":{"v":0,"d":"0Lmn"}}]
[{"$nulls":4},10.6,96,"m",null,"mn",{"$f":"'6bis'!$J$5*E59*H59","v":{"v":0,"d":"0Lmn"}}]
[{"$nulls":4},10.8,98,"m",null,"mn",{"$f":"'6bis'!$J$5*E60*H60","v":{"v":0,"d":"0Lmn"}}]
[{"$nulls":4},11,100,"m",null,"mn",{"$f":"'6bis'!$J$5*E61*H61","v":{"v":0,"d":"0Lmn"}}]
[{"$nulls":4},11.2,102,"m",null,"mn",{"$f":"'6bis'!$J$5*E62*H62","v":{"v":0,"d":"0Lmn"}}]
[{"$nulls":4},11.4,104,"m",null,"mn",{"$f":"'6bis'!$J$5*E63*H63","v":{"v":0,"d":"0Lmn"}}]
[{"$nulls":4},11.6,106,"m",null,"mn",{"$f":"'6bis'!$J$5*E64*H64","v":{"v":0,"d":"0Lmn"}}]
[{"$nulls":4},11.8,108,"m",null,"mn",{"$f":"'6bis'!$J$5*E65*H65","v":{"v":0,"d":"0Lmn"}}]
[{"$nulls":4},12,110,"m",null,"mn",{"$f":"'6bis'!$J$5*E66*H66","v":{"v":0,"d":"0Lmn"}}]
[{"$nulls":4},12.2,112,"m",null,"mn",{"$f":"'6bis'!$J$5*E67*H67","v":{"v":0,"d":"0Lmn"}}]
[{"$nulls":4},12.4,114,"m",null,"mn",{"$f":"'6bis'!$J$5*E68*H68","v":{"v":0,"d":"0Lmn"}}]
[{"$nulls":4},12.6,116,"m",null,"mn",{"$f":"'6bis'!$J$5*E69*H69","v":{"v":0,"d":"0Lmn"}}]
[{"$nulls":4},12.8,118,"m",null,"mn",{"$f":"'6bis'!$J$5*E70*H70","v":{"v":0,"d":"0Lmn"}}]
[{"$nulls":4},13,120,"m",null,"mn",{"$f":"'6bis'!$J$5*E71*H71","v":{"v":0,"d":"0Lmn"}}]
[{"$nulls":4},13.2,122,"m",null,"mn",{"$f":"'6bis'!$J$5*E72*H72","v":{"v":0,"d":"0Lmn"}}]
[null,"trajet aller",null,null,13.4,124,"m",null,"mn",{"$f":"'6bis'!$J$5*E73*H73","v":{"v":0,"d":"0Lmn"}}]
[null,"gaz disponible",null,{"$f":"$I$6","v":{"v":2903.514376996805,"d":"2,904L"}},13.6,126,"m",null,"mn",{"$f":"'6bis'!$J$5*E74*H74","v":{"v":0,"d":"0Lmn"}},{"$f":"IF($J$162>$I$6,\"AUTONOMIE  DEPASSEE !\",\"\")","v":""}]
[null,"gaz consommé",null,{"$f":"$J$162","v":{"v":0,"d":"0L"}},13.8,128,"m",null,{"$f":"IF($J$162>$I$6,\"stop !\",\"mn\")","v":"mn"},{"$f":"'6bis'!$J$5*E75*H75","v":{"v":0,"d":"0Lmn"}}]
[null,"temps aller ",null,{"$f":"$H$162","v":{"v":0,"d":"0mn"}},14,130,"m",null,"mn",{"$f":"'6bis'!$J$5*E76*H76","v":{"v":0,"d":"0Lmn"}}]
[{"$nulls":4},14.2,132,"m",null,"mn",{"$f":"'6bis'!$J$5*E77*H77","v":{"v":0,"d":"0Lmn"}}]
[{"$nulls":4},14.4,134,"m",null,"mn",{"$f":"'6bis'!$J$5*E78*H78","v":{"v":0,"d":"0Lmn"}}]
[{"$nulls":4},14.6,136,"m",null,"mn",{"$f":"'6bis'!$J$5*E79*H79","v":{"v":0,"d":"0Lmn"}}]
[{"$nulls":4},14.8,138,"m",null,"mn",{"$f":"'6bis'!$J$5*E80*H80","v":{"v":0,"d":"0Lmn"}}]
[{"$nulls":4},15,140,"m",null,"mn",{"$f":"'6bis'!$J$5*E81*H81","v":{"v":0,"d":"0Lmn"}}]
[{"$nulls":4},15.2,142,"m",null,"mn",{"$f":"'6bis'!$J$5*E82*H82","v":{"v":0,"d":"0Lmn"}}]
[{"$nulls":4},15.4,144,"m",null,"mn",{"$f":"'6bis'!$J$5*E83*H83","v":{"v":0,"d":"0Lmn"}}]
[{"$nulls":4},15.6,146,"m",null,"mn",{"$f":"'6bis'!$J$5*E84*H84","v":{"v":0,"d":"0Lmn"}}]
[{"$nulls":4},15.8,148,"m",null,"mn",{"$f":"'6bis'!$J$5*E85*H85","v":{"v":0,"d":"0Lmn"}}]
[{"$nulls":4},16,150,"m",null,"mn",{"$f":"'6bis'!$J$5*E86*H86","v":{"v":0,"d":"0Lmn"}}]
[{"$nulls":4},16.2,152,"m",null,"mn",{"$f":"'6bis'!$J$5*E87*H87","v":{"v":0,"d":"0Lmn"}}]
[{"$nulls":4},16.4,154,"m",null,"mn",{"$f":"'6bis'!$J$5*E88*H88","v":{"v":0,"d":"0Lmn"}}]
[{"$nulls":4},16.6,156,"m",null,"mn",{"$f":"'6bis'!$J$5*E89*H89","v":{"v":0,"d":"0Lmn"}}]
[{"$nulls":4},16.8,158,"m",null,"mn",{"$f":"'6bis'!$J$5*E90*H90","v":{"v":0,"d":"0Lmn"}}]
[null,"trajet aller",null,null,17,160,"m",null,"mn",{"$f":"'6bis'!$J$5*E91*H91","v":{"v":0,"d":"0Lmn"}}]
[null,"gaz disponible",null,{"$f":"$I$6","v":{"v":2903.514376996805,"d":"2,904L"}},17.2,162,"m",null,"mn",{"$f":"'6bis'!$J$5*E92*H92","v":{"v":0,"d":"0Lmn"}},{"$f":"IF($J$162>$I$6,\"AUTONOMIE  DEPASSEE !\",\"\")","v":""}]
[null,"gaz consommé",null,{"$f":"$J$162","v":{"v":0,"d":"0L"}},17.4,164,"m",null,"mn",{"$f":"'6bis'!$J$5*E93*H93","v":{"v":0,"d":"0Lmn"}}]
[null,"temps aller ",null,{"$f":"$H$162","v":{"v":0,"d":"0mn"}},17.6,166,"m",null,"mn",{"$f":"'6bis'!$J$5*E94*H94","v":{"v":0,"d":"0Lmn"}}]
[{"$nulls":4},17.8,168,"m",null,"mn",{"$f":"'6bis'!$J$5*E95*H95","v":{"v":0,"d":"0Lmn"}}]
[{"$nulls":4},18,170,"m",null,"mn",{"$f":"'6bis'!$J$5*E96*H96","v":{"v":0,"d":"0Lmn"}}]
[{"$nulls":4},18.2,172,"m",null,"mn",{"$f":"'6bis'!$J$5*E97*H97","v":{"v":0,"d":"0Lmn"}}]
[{"$nulls":4},18.4,174,"m",null,"mn",{"$f":"'6bis'!$J$5*E98*H98","v":{"v":0,"d":"0Lmn"}}]
[{"$nulls":4},18.6,176,"m",null,"mn",{"$f":"'6bis'!$J$5*E99*H99","v":{"v":0,"d":"0Lmn"}}]
[{"$nulls":4},18.8,178,"m",null,"mn",{"$f":"'6bis'!$J$5*E100*H100","v":{"v":0,"d":"0Lmn"}}]
[{"$nulls":4},19,180,"m",null,"mn",{"$f":"'6bis'!$J$5*E101*H101","v":{"v":0,"d":"0Lmn"}}]
[{"$nulls":4},19.2,182,"m",null,"mn",{"$f":"'6bis'!$J$5*E102*H102","v":{"v":0,"d":"0Lmn"}}]
[{"$nulls":4},19.4,184,"m",null,"mn",{"$f":"'6bis'!$J$5*E103*H103","v":{"v":0,"d":"0Lmn"}}]
[{"$nulls":4},19.6,186,"m",null,"mn",{"$f":"'6bis'!$J$5*E104*H104","v":{"v":0,"d":"0Lmn"}}]
[{"$nulls":4},19.8,188,"m",null,"mn",{"$f":"'6bis'!$J$5*E105*H105","v":{"v":0,"d":"0Lmn"}}]
[{"$nulls":4},20,190,"m",null,"mn",{"$f":"'6bis'!$J$5*E106*H106","v":{"v":0,"d":"0Lmn"}}]
[{"$nulls":4},20.2,192,"m",null,{"$f":"IF($J$162>$I$6,\"stop !\",\"mn\")","v":"mn"},{"$f":"'6bis'!$J$5*E107*H107","v":{"v":0,"d":"0Lmn"}}]
[{"$nulls":4},20.4,194,"m",null,"mn",{"$f":"'6bis'!$J$5*E108*H108","v":{"v":0,"d":"0Lmn"}}]
[{"$nulls":4},20.6,196,"m",null,"mn",{"$f":"'6bis'!$J$5*E109*H109","v":{"v":0,"d":"0Lmn"}}]
[null,"trajet aller",null,null,20.8,198,"m",null,"mn",{"$f":"'6bis'!$J$5*E110*H110","v":{"v":0,"d":"0Lmn"}},{"$f":"IF($J$162>$I$6,\"AUTONOMIE  DEPASSEE !\",\"\")","v":""}]
[null,"gaz disponible",null,{"$f":"$I$6","v":{"v":2903.514376996805,"d":"2,904L"}},21,200,"m",null,"mn",{"$f":"'6bis'!$J$5*E111*H111","v":{"v":0,"d":"0Lmn"}}]
[null,"gaz consommé",null,{"$f":"$J$162","v":{"v":0,"d":"0L"}},21.2,202,"m",null,"mn",{"$f":"'6bis'!$J$5*E112*H112","v":{"v":0,"d":"0Lmn"}}]
[null,"temps aller ",null,{"$f":"$H$162","v":{"v":0,"d":"0mn"}},21.4,204,"m",null,"mn",{"$f":"'6bis'!$J$5*E113*H113","v":{"v":0,"d":"0Lmn"}}]
[{"$nulls":4},21.6,206,"m",null,"mn",{"$f":"'6bis'!$J$5*E114*H114","v":{"v":0,"d":"0Lmn"}}]
[{"$nulls":4},21.8,208,"m",null,"mn",{"$f":"'6bis'!$J$5*E115*H115","v":{"v":0,"d":"0Lmn"}}]
[{"$nulls":4},22,210,"m",null,"mn",{"$f":"'6bis'!$J$5*E116*H116","v":{"v":0,"d":"0Lmn"}}]
[{"$nulls":4},22.2,212,"m",null,"mn",{"$f":"'6bis'!$J$5*E117*H117","v":{"v":0,"d":"0Lmn"}}]
[{"$nulls":4},22.4,214,"m",null,"mn",{"$f":"'6bis'!$J$5*E118*H118","v":{"v":0,"d":"0Lmn"}}]
[{"$nulls":4},22.6,216,"m",null,"mn",{"$f":"'6bis'!$J$5*E119*H119","v":{"v":0,"d":"0Lmn"}}]
[{"$nulls":4},22.8,218,"m",null,"mn",{"$f":"'6bis'!$J$5*E120*H120","v":{"v":0,"d":"0Lmn"}}]
[{"$nulls":4},23,220,"m",null,"mn",{"$f":"'6bis'!$J$5*E121*H121","v":{"v":0,"d":"0Lmn"}}]
[{"$nulls":4},23.2,222,"m",null,"mn",{"$f":"'6bis'!$J$5*E122*H122","v":{"v":0,"d":"0Lmn"}}]
[{"$nulls":4},23.4,224,"m",null,"mn",{"$f":"'6bis'!$J$5*E123*H123","v":{"v":0,"d":"0Lmn"}}]
[{"$nulls":4},23.6,226,"m",null,"mn",{"$f":"'6bis'!$J$5*E124*H124","v":{"v":0,"d":"0Lmn"}}]
[{"$nulls":4},23.8,228,"m",null,"mn",{"$f":"'6bis'!$J$5*E125*H125","v":{"v":0,"d":"0Lmn"}}]
[{"$nulls":4},24,230,"m",null,"mn",{"$f":"'6bis'!$J$5*E126*H126","v":{"v":0,"d":"0Lmn"}}]
[null,"trajet aller",null,null,24.2,232,"m",null,"mn",{"$f":"'6bis'!$J$5*E127*H127","v":{"v":0,"d":"0Lmn"}}]
[null,"gaz disponible",null,{"$f":"$I$6","v":{"v":2903.514376996805,"d":"2,904L"}},24.4,234,"m",null,"mn",{"$f":"'6bis'!$J$5*E128*H128","v":{"v":0,"d":"0Lmn"}},{"$f":"IF($J$162>$I$6,\"AUTONOMIE  DEPASSEE !\",\"\")","v":""}]
[null,"gaz consommé",null,{"$f":"$J$162","v":{"v":0,"d":"0L"}},24.6,236,"m",null,"mn",{"$f":"'6bis'!$J$5*E129*H129","v":{"v":0,"d":"0Lmn"}}]
[null,"temps aller ",null,{"$f":"$H$162","v":{"v":0,"d":"0mn"}},24.8,238,"m",null,"mn",{"$f":"'6bis'!$J$5*E130*H130","v":{"v":0,"d":"0Lmn"}}]
[{"$nulls":4},25,240,"m",null,"mn",{"$f":"'6bis'!$J$5*E131*H131","v":{"v":0,"d":"0Lmn"}}]
[{"$nulls":4},25.2,242,"m",null,"mn",{"$f":"'6bis'!$J$5*E132*H132","v":{"v":0,"d":"0Lmn"}}]
[{"$nulls":4},25.4,244,"m",null,"mn",{"$f":"'6bis'!$J$5*E133*H133","v":{"v":0,"d":"0Lmn"}}]
[{"$nulls":4},25.6,246,"m",null,"mn",{"$f":"'6bis'!$J$5*E134*H134","v":{"v":0,"d":"0Lmn"}}]
[{"$nulls":4},25.8,248,"m",null,"mn",{"$f":"'6bis'!$J$5*E135*H135","v":{"v":0,"d":"0Lmn"}}]
[{"$nulls":4},26,250,"m",null,"mn",{"$f":"'6bis'!$J$5*E136*H136","v":{"v":0,"d":"0Lmn"}}]
[{"$nulls":4},26.2,252,"m",null,"mn",{"$f":"'6bis'!$J$5*E137*H137","v":{"v":0,"d":"0Lmn"}}]
[{"$nulls":4},26.4,254,"m",null,"mn",{"$f":"'6bis'!$J$5*E138*H138","v":{"v":0,"d":"0Lmn"}}]
[{"$nulls":4},26.6,256,"m",null,{"$f":"IF($J$162>$I$6,\"stop !\",\"mn\")","v":"mn"},{"$f":"'6bis'!$J$5*E139*H139","v":{"v":0,"d":"0Lmn"}}]
[{"$nulls":4},26.8,258,"m",null,"mn",{"$f":"'6bis'!$J$5*E140*H140","v":{"v":0,"d":"0Lmn"}}]
[{"$nulls":4},27,260,"m",null,"mn",{"$f":"'6bis'!$J$5*E141*H141","v":{"v":0,"d":"0Lmn"}}]
[{"$nulls":4},27.2,262,"m",null,"mn",{"$f":"'6bis'!$J$5*E142*H142","v":{"v":0,"d":"0Lmn"}}]
[{"$nulls":4},27.4,264,"m",null,"mn",{"$f":"'6bis'!$J$5*E143*H143","v":{"v":0,"d":"0Lmn"}}]
[{"$nulls":4},27.6,266,"m",null,"mn",{"$f":"'6bis'!$J$5*E144*H144","v":{"v":0,"d":"0Lmn"}}]
[null,"trajet aller",null,null,27.8,268,"m",null,"mn",{"$f":"'6bis'!$J$5*E145*H145","v":{"v":0,"d":"0Lmn"}}]
[null,"gaz disponible",null,{"$f":"$I$6","v":{"v":2903.514376996805,"d":"2,904L"}},28,270,"m",null,"mn",{"$f":"'6bis'!$J$5*E146*H146","v":{"v":0,"d":"0Lmn"}},{"$f":"IF($J$162>$I$6,\"AUTONOMIE  DEPASSEE !\",\"\")","v":""}]
[null,"gaz consommé",null,{"$f":"$J$162","v":{"v":0,"d":"0L"}},28.2,272,"m",null,"mn",{"$f":"'6bis'!$J$5*E147*H147","v":{"v":0,"d":"0Lmn"}}]
[null,"temps aller ",null,{"$f":"$H$162","v":{"v":0,"d":"0mn"}},28.4,274,"m",null,"mn",{"$f":"'6bis'!$J$5*E148*H148","v":{"v":0,"d":"0Lmn"}}]
[{"$nulls":4},28.6,276,"m",null,"mn",{"$f":"'6bis'!$J$5*E149*H149","v":{"v":0,"d":"0Lmn"}}]
[{"$nulls":4},28.8,278,"m",null,"mn",{"$f":"'6bis'!$J$5*E150*H150","v":{"v":0,"d":"0Lmn"}}]
[{"$nulls":4},29,280,"m",null,"mn",{"$f":"'6bis'!$J$5*E151*H151","v":{"v":0,"d":"0Lmn"}}]
[{"$nulls":4},29.2,282,"m",null,"mn",{"$f":"'6bis'!$J$5*E152*H152","v":{"v":0,"d":"0Lmn"}}]
[{"$nulls":4},29.4,284,"m",null,"mn",{"$f":"'6bis'!$J$5*E153*H153","v":{"v":0,"d":"0Lmn"}}]
[{"$nulls":4},29.6,286,"m",null,"mn",{"$f":"'6bis'!$J$5*E154*H154","v":{"v":0,"d":"0Lmn"}}]
[{"$nulls":4},29.8,288,"m",null,"mn",{"$f":"'6bis'!$J$5*E155*H155","v":{"v":0,"d":"0Lmn"}}]
[{"$nulls":4},30,290,"m",null,"mn",{"$f":"'6bis'!$J$5*E156*H156","v":{"v":0,"d":"0Lmn"}}]
[{"$nulls":4},30.2,292,"m",null,"mn",{"$f":"'6bis'!$J$5*E157*H157","v":{"v":0,"d":"0Lmn"}}]
[{"$nulls":4},30.4,294,"m",null,"mn",{"$f":"'6bis'!$J$5*E158*H158","v":{"v":0,"d":"0Lmn"}}]
[{"$nulls":4},30.6,296,"m",null,"mn",{"$f":"'6bis'!$J$5*E159*H159","v":{"v":0,"d":"0Lmn"}}]
[{"$nulls":4},30.8,298,"m",null,"mn",{"$f":"'6bis'!$J$5*E160*H160","v":{"v":0,"d":"0Lmn"}}]
[{"$nulls":4},31,300,"m",null,"mn",{"$f":"'6bis'!$J$5*E161*H161","v":{"v":0,"d":"0Lmn"}}]
[{"$nulls":7},{"$f":"SUM(H11:H161)","v":0},null,{"$f":"SUM(J10:J161)","v":0}]

{"sheet":"7","index":9,"n_rows":185,"n_cols":19,"rows_kept":185,"merged":[[2,2,5,15],[2,16,5,18],[3,0,3,1],[5,0,5,1],[6,7,6,13],[7,3,7,4],[7,6,7,7],[7,9,7,11],[7,13,7,14],[8,3,8,4],[8,6,8,7],[8,9,8,11],[8,13,8,14],[9,6,9,14],[10,3,10,4],[10,6,10,7],[10,8,10,12],[10,13,10,16],[11,3,12,4],[11,6,12,7],[11,8,11,12],[11,13,11,15],[12,9,12,11],[12,13,12,16],[13,9,13,11],[13,13,13,16],[14,13,14,16],[15,7,16,9],[17,11,18,14],[19,0,20,0],[19,3,20,3],[19,4,20,4],[19,5,20,5],[19,6,20,6],[19,7,20,7],[19,8,20,8],[19,9,20,9],[19,11,20,14],[21,11,21,14],[22,11,22,14],[23,13,23,14],[24,2,25,8],[24,11,24,14],[25,11,25,14],[26,11,26,14],[27,3,28,8],[27,12,27,13],[29,3,29,8],[30,3,30,8],[30,11,30,14],[31,3,32,5],[31,6,32,7],[31,8,32,8],[31,11,31,14],[32,11,32,14],[33,4,33,5],[33,6,33,7],[33,11,33,14],[34,4,34,5],[34,6,34,7],[35,4,35,5],[35,6,35,7],[36,4,36,5],[36,6,36,7],[37,4,37,5],[37,6,37,7],[38,4,38,5],[38,6,38,7],[38,11,38,12],[38,13,38,14],[39,4,39,5],[39,6,39,7],[39,13,39,14],[40,4,40,5],[40,6,40,7],[40,13,40,14],[41,4,41,5],[41,6,41,7],[42,4,42,5],[42,6,42,7],[42,12,42,15],[43,4,43,5],[43,6,43,7],[43,10,43,11],[44,4,44,5],[44,6,44,7],[45,4,45,5],[45,6,45,7],[46,4,46,5],[46,6,46,7],[47,4,47,5],[47,6,47,7],[48,4,48,5],[48,6,48,7],[49,4,49,5],[49,6,49,7],[50,4,50,5],[50,6,50,7],[51,4,51,5],[51,6,51,7],[52,4,52,5],[52,6,52,7],[53,4,53,5],[53,6,53,7],[54,4,54,5],[54,6,54,7],[55,4,55,5],[55,6,55,7],[56,4,56,5],[56,6,56,7],[57,4,57,5],[57,6,57,7],[58,4,58,5],[58,6,58,7],[59,4,59,5],[59,6,59,7],[60,4,60,5],[60,6,60,7],[61,4,61,5],[61,6,61,7],[62,4,62,5],[62,6,62,7],[63,4,63,5],[63,6,63,7],[64,4,64,5],[64,6,64,7],[65,4,65,5],[65,6,65,7],[66,4,66,5],[66,6,66,7],[67,4,67,5],[67,6,67,7],[68,4,68,5],[68,6,68,7],[69,4,69,5],[69,6,69,7],[70,4,70,5],[70,6,70,7],[71,4,71,5],[71,6,71,7],[72,4,72,5],[72,6,72,7],[73,4,73,5],[73,6,73,7],[74,4,74,5],[74,6,74,7],[75,4,75,5],[75,6,75,7],[76,4,76,5],[76,6,76,7],[77,4,77,5],[77,6,77,7],[78,4,78,5],[78,6,78,7],[79,4,79,5],[79,6,79,7],[80,4,80,5],[80,6,80,7],[81,4,81,5],[81,6,81,7],[82,4,82,5],[82,6,82,7],[83,4,83,5],[83,6,83,7],[84,4,84,5],[84,6,84,7],[85,4,85,5],[85,6,85,7],[86,4,86,5],[86,6,86,7],[87,4,87,5],[87,6,87,7],[88,4,88,5],[88,6,88,7],[89,4,89,5],[89,6,89,7],[90,4,90,5],[90,6,90,7],[91,4,91,5],[91,6,91,7],[92,4,92,5],[92,6,92,7],[93,4,93,5],[93,6,93,7],[94,4,94,5],[94,6,94,7],[95,4,95,5],[95,6,95,7],[96,4,96,5],[96,6,96,7],[97,4,97,5],[97,6,97,7],[98,4,98,5],[98,6,98,7],[99,4,99,5],[99,6,99,7],[100,4,100,5],[100,6,100,7],[101,4,101,5],[101,6,101,7],[102,4,102,5],[102,6,102,7],[103,4,103,5],[103,6,103,7],[104,4,104,5],[104,6,104,7],[105,4,105,5],[105,6,105,7],[106,4,106,5],[106,6,106,7],[107,4,107,5],[107,6,107,7],[108,4,108,5],[108,6,108,7],[109,4,109,5],[109,6,109,7],[110,4,110,5],[110,6,110,7],[111,4,111,5],[111,6,111,7],[112,4,112,5],[112,6,112,7],[113,4,113,5],[113,6,113,7],[114,4,114,5],[114,6,114,7],[115,4,115,5],[115,6,115,7],[116,4,116,5],[116,6,116,7],[117,4,117,5],[117,6,117,7],[118,4,118,5],[118,6,118,7],[119,4,119,5],[119,6,119,7],[120,4,120,5],[120,6,120,7],[121,4,121,5],[121,6,121,7],[122,4,122,5],[122,6,122,7],[123,4,123,5],[123,6,123,7],[124,4,124,5],[124,6,124,7],[125,4,125,5],[125,6,125,7],[126,4,126,5],[126,6,126,7],[127,4,127,5],[127,6,127,7],[128,4,128,5],[128,6,128,7],[129,4,129,5],[129,6,129,7],[130,4,130,5],[130,6,130,7],[131,4,131,5],[131,6,131,7],[132,4,132,5],[132,6,132,7],[133,4,133,5],[133,6,133,7],[134,4,134,5],[134,6,134,7],[135,4,135,5],[135,6,135,7],[136,4,136,5],[136,6,136,7],[137,4,137,5],[137,6,137,7],[138,4,138,5],[138,6,138,7],[139,4,139,5],[139,6,139,7],[140,4,140,5],[140,6,140,7],[141,4,141,5],[141,6,141,7],[142,4,142,5],[142,6,142,7],[143,4,143,5],[143,6,143,7],[144,4,144,5],[144,6,144,7],[145,4,145,5],[145,6,145,7],[146,4,146,5],[146,6,146,7],[147,4,147,5],[147,6,147,7],[148,4,148,5],[148,6,148,7],[149,4,149,5],[149,6,149,7],[150,4,150,5],[150,6,150,7],[151,4,151,5],[151,6,151,7],[152,4,152,5],[152,6,152,7],[153,4,153,5],[153,6,153,7],[154,4,154,5],[154,6,154,7],[155,4,155,5],[155,6,155,7],[156,4,156,5],[156,6,156,7],[157,4,157,5],[157,6,157,7],[158,4,158,5],[158,6,158,7],[159,4,159,5],[159,6,159,7],[160,4,160,5],[160,6,160,7],[161,4,161,5],[161,6,161,7],[162,4,162,5],[162,6,162,7],[163,4,163,5],[163,6,163,7],[164,4,164,5],[164,6,164,7],[165,4,165,5],[165,6,165,7],[166,4,166,5],[166,6,166,7],[167,4,167,5],[167,6,167,7],[168,4,168,5],[168,6,168,7],[169,4,169,5],[169,6,169,7],[170,4,170,5],[170,6,170,7],[171,4,171,5],[171,6,171,7],[172,4,172,5],[172,6,172,7],[173,4,173,5],[173,6,173,7],[174,4,174,5],[174,6,174,7],[175,4,175,5],[175,6,175,7],[176,4,176,5],[176,6,176,7],[177,4,177,5],[177,6,177,7],[178,4,178,5],[178,6,178,7],[179,4,179,5],[179,6,179,7],[180,4,180,5],[180,6,180,7],[181,4,181,5],[181,6,181,7],[182,4,182,5],[182,6,182,7],[183,4,183,5],[183,6,183,7]]}
["JP Couloumy"]
[]
[null,null,"CALCUL des BOUTEILLES  :   Bi, Tri, Quadri, Relais"]
[]
[]
[]
[{"$nulls":7},{"$f":"IF(Q12=\"\",\"(profondeur Vitesse Distance) ne servent à rien si multi profondeurs\",IF(G10=\"\",\"\",\"(profondeur Vitesse Distance) ne servent à rien si multi profondeurs\"))","v":"(profondeur Vitesse Distance) ne servent à rien si multi profondeurs"}]
["( lire 1)",null,null,{"$f":"IF(Q12=\"$\",\"conso surface $\",\"consos surface\")","v":"consos surface"},null,null,{"$f":"IF(Q12=\"\",\"profondeur\",IF(G9=0,\"\",IF(Q12=\"$\",\"faire suppr\",\"profondeur\")))","v":"profondeur"},null,null,{"$f":"IF(Q12=\"\",\"vitesse\",IF(J9=0,\"\",IF(Q12=\"$\",\"faire suppr\",\"vitesse\")))","v":"vitesse"},{"$nulls":3},{"$f":"IF(Q12=\"\",\"distance aller\",IF(N9=0,\"\",IF(Q12=\"$\",\"faire suppr\",\"distance aller\")))","v":"distance aller"}]
[{"$nulls":3},{"v":25,"d":"25 L/mn"},null,null,{"v":30,"d":"30 m"},null,null,{"v":18,"d":"18 m/mn"},{"$nulls":3},{"v":600,"d":"600 m"}]
[{"$nulls":6},{"$f":"IF(G9+J9+N9=0,\"\",IF(Q12=\"$\",\"Pour éviter les confusions si $, taper suppr dans ces 3 cellules jaunes !\",\"\"))","v":""}]
[{"$nulls":3},{"$f":"IF(Q12=\"$\",\"temps aller $\",\"temps aller\")","v":"temps aller"},null,null,{"$f":"IF(Q12=\"$\",\"conso  aller $\",\"consos  aller\")","v":"consos  aller"},null,{"$f":"IF(Q12=\"$\",\"\",IF(OR(D9=0,G9=0,J9=0,N9=0),\"Profil carré ! Vous devez renseigner\",\"\"))","v":""},{"$nulls":4},"( si multi profondeurs )"]
[{"$nulls":3},{"$f":"IF(Q12=\"$\",G185,(1/J9*N9))","v":{"v":33.33333333333333,"d":"33 mm"}},null,null,{"$f":"IF(Q12=\"$\",J185,((G9/10)+1)*D9*D12)","v":{"v":3333.333333333333,"d":"3333 L"}},null,{"$f":"IF(Q12=\"$\",\"\",IF(OR(D9=0,G9=0,J9=0,N9=0),\"les quatre cellules jaunes au dessus.\",\"\"))","v":""},{"$nulls":4},"taper $ ici"]
[{"$nulls":13},"Entrer la conso surface + la règle"]
[{"$nulls":9},{"$f":"IF(Q12=\"$\",\"Règle des   ($)\",\"Règle des\")","v":"Règle des"},{"$nulls":3},"Le profil (temps tableau du bas)"]
[null,null,{"$f":"IF(Q12=\"$\",\"Bouteilles nécessaires $\",\"Bouteilles nécessaires\")","v":"Bouteilles nécessaires"},{"$nulls":6},1," /",3,null,"Puis les bouteilles"]
[{"$nulls":7},"Rectification pour                     pressions élevées"]
[]
["g12*L15",{"$f":"G12*L15","v":10000},{"$nulls":9},{"$f":"IF(B19=0,\"\",IF(G12=0,\"\",IF($G$12*$L$15<=B19,\"\",\"Pas suffisant\")))","v":""}]
["total bout",{"$f":"A20+A22+A23+A24","v":10008},null,{"$f":"IF(Q12=\"$\",\"Bouteilles $\",\"Bouteilles\")","v":"Bouteilles"},null,{"$f":"IF(Q12=\"$\",\"Nombre $\",\"Nombre\")","v":"Nombre"},null,{"$f":"IF(Q12=\"$\",\"Pressions $\",\"Pressions\")","v":"Pressions"},{"$f":"IF(I18=1,\"Gonfler à\",\"\")","v":""},{"$f":"IF(I18=1,\"Retour à\",\"\")","v":""}]
[{"$f":"D20*H20*F20","v":3600},null,null,{"v":9,"d":"9.0 L"},{"$f":"IF(D20=0,\"\",\"X\")","v":"X"},2,{"$f":"IF(F20=0,\"\",\"à\")","v":"à"},{"v":200,"d":"200  B"},{"$f":"IF(A20=0,\"\",IF($I$18=0,\"retour à\",IF(H20>=266,H20+30,IF(H20>=246,H20+25,IF(H20>=231,H20+20,IF(H20>=216,H20+15,IF(H20>=200,H20+10,H20)))))))","v":"retour à"},{"$f":"IF(A20=0,\"\",H20-H20/$L$15)","v":{"v":133.33333333333331,"d":"133 Bars"}},null,{"$f":"IF(B19=0,\"\",IF(G12=0,\"\",IF($G$12*$L$15<=B19,\"OK\",\"il manque\")))","v":"OK"}]
[]
[{"$f":"D22*H22*F22","v":3924},null,null,{"v":9,"d":"9.0 L"},{"$f":"IF(D22=0,\"\",\"X\")","v":"X"},2,{"$f":"IF(F22=0,\"\",\"à\")","v":"à"},{"v":218,"d":"218  B"},{"$f":"IF(A22=0,\"\",IF($I$18=0,\"retour à\",IF(H22>=266,H22+30,IF(H22>=246,H22+25,IF(H22>=231,H22+20,IF(H22>=216,H22+15,IF(H22>=200,H22+10,H22)))))))","v":"retour à"},{"$f":"IF(A22=0,\"\",H22-H22/$L$15)","v":{"v":145.33333333333331,"d":"145 Bars"}},null,{"$f":"IF(B19=0,\"\",IF(G12=0,\"\",IF(L20=\"OK\",\"\",($G$12*$L$15)-(B19))))","v":""},{"$nulls":6},"Zone libre "]
[{"$f":"D23*H23*F23","v":2484},null,null,{"v":12,"d":"12.0 L"},{"$f":"IF(D23=0,\"\",\"X\")","v":"X"},1,{"$f":"IF(F23=0,\"\",\"à\")","v":"à"},{"v":207,"d":"207  B"},{"$f":"IF(A23=0,\"\",IF($I$18=0,\"retour à\",IF(H23>=266,H23+30,IF(H23>=246,H23+25,IF(H23>=231,H23+20,IF(H23>=216,H23+15,IF(H23>=200,H23+10,H23)))))))","v":"retour à"},{"$f":"IF(A23=0,\"\",H23-H23/$L$15)","v":{"v":138,"d":"138 Bars"}},null,{"$f":"IF(B19=0,\"\",IF(G12=0,\"\",IF($G$12*$L$15<=B19,\"il y a même\",\"\")))","v":"il y a même"}]
[{"$f":"D24*H24*F24","v":0},{"$nulls":3},{"$f":"IF(D24=0,\"\",\"X\")","v":""},null,{"$f":"IF(F24=0,\"\",\"à\")","v":""},null,{"$f":"IF(A24=0,\"\",IF($I$18=0,\"retour à\",IF(H24>=266,H24+30,IF(H24>=246,H24+25,IF(H24>=231,H24+20,IF(H24>=216,H24+15,IF(H24>=200,H24+10,H24)))))))","v":""},{"$f":"IF(A24=0,\"\",H24-H24/$L$15)","v":""},null,{"$f":"IF(B19=0,\"\",IF(G12=0,\"\",IF(L20=\"OK\",B19-($G$12*$L$15),\"\")))","v":8},{"$f":"IF(B19=0,\"\",IF(G12=0,\"\",IF($G$12*$L$15<=B19,\"L\",\"\")))","v":"L"},{"$f":"IF(B19=0,\"\",IF(G12=0,\"\",IF($G$12*$L$15<=B19,\" en plus !\",\"\")))","v":" en plus !"}]
[null,null,{"$f":"IF(G12=0,\"\",IF(B19=0,\"\",IF(L20=\"il manque\",\"\",IF(OR(F20=1,F22=1,F23=1,F24=1),\"A contrôler avec le simulateur !\",\"\"))))","v":"A contrôler avec le simulateur !"},{"$nulls":8},{"$f":"IF(G12=0,\"\",IF(B19=0,\"\",IF(L20=\"il manque\",\"\",IF(L24>=21,\"  Descendre entre 0 et 20 L\",IF(L24<10,\"c'est très bien ça !\",IF(L24<21,\"c'est bien !\"))))))","v":"c'est très bien ça !"}]
[{"$nulls":11},{"$f":"IF(G12=0,\"\",IF(B19=0,\"\",IF(L20=\"il manque\",\"\",IF(L24>=21,\"pour la précision du simulateur\",\"\"))))","v":""}]
[{"$nulls":11},{"$f":"IF(G12=0,\"\",IF(B19=0,\"\",IF(L20=\"il manque\",\"\",IF(L24>=21,\"et des pressions de retour\",\"\"))))","v":""}]
["Clic",null,null,{"$f":"IF(Q12=\"$\",\"PROFIL PLONGEE MULTI PROFONDEURS  $\",\"Tableau pour multi profondeurs (si $)\")","v":"Tableau pour multi profondeurs (si $)"}]
["Fenêtre"]
["Figer les volets",null,null,{"$f":"IF(Q12=\"$\",\"entrer le temps passé aux profondeurs principales\",\"\" )","v":""},{"$nulls":6},"!"]
[{"$nulls":3},{"$f":"IF(Q12=\"$\",\"(puis vos bouteilles au tableau en dessus)\",\"\")","v":""},{"$nulls":7},{"$f":"IF(Q12=\"$\",\"Simulateur de panne $\",\"Simulateur de panne\")","v":"Simulateur de panne"}]
["Fenêtre",null,null,{"$f":"IF(Q12=\"$\",\"prof. $\",\"\")","v":""},null,null,{"$f":"IF(Q12=\"$\",\"temps $\",\"\")","v":""},null,{"$f":"IF(Q12=\"\",\"\",IF(G185=0,0,G185))","v":""},null,null,"taper 1 dans la cellule jaune "]
["Libérer les volets",{"$nulls":10},"à droite de la bouteille supposée en panne."]
[null,null,1,0,"m",{"$nulls":3},{"$f":"IF($M$163>$J$4,\"stop !\",\"mn\")","v":"mn"},{"$f":"$D$9*C34*G34","v":{"v":0,"d":"0Lmn"}},null,"(maxi 1 bouteille en panne par ligne !)",{"$nulls":6},"Zone libre"]
[null,null,1.2,2,"m",{"$nulls":3},"mn",{"v":0,"d":"0Lmn"},null,{"$f":"IF(G12=0,\"\",IF(L20=\"il manque\",\"\",IF(L24>21,\"\",IF(D20*F20*H20=0,\"\",D20))))","v":{"v":9,"d":"9 L"}},{"$f":"IF(G12=0,\"\",IF(L20=\"il manque\",\"\",IF(L24>21,\"\",IF(D20*F20*H20=0,\"\",F20))))","v":2},{"$f":"IF(G12=0,\"\",IF(L20=\"il manque\",\"\",IF(L24>21,\"\",IF(D20*F20*H20=0,\"\",H20))))","v":{"v":200,"d":"200 B"}}]
[null,null,1.4,4,"m",{"$nulls":3},"mn",{"v":0,"d":"0Lmn"},null,{"$f":"IF(G12=0,\"\",IF(L20=\"il manque\",\"\",IF(L24>21,\"\",IF(D22*F22*H22=0,\"\",D22))))","v":{"v":9,"d":"9 L"}},{"$f":"IF(G12=0,\"\",IF(L20=\"il manque\",\"\",IF(L24>21,\"\",IF(D22*F22*H22=0,\"\",F22))))","v":2},{"$f":"IF(G12=0,\"\",IF(L20=\"il manque\",\"\",IF(L24>21,\"\",IF(D22*F22*H22=0,\"\",H22))))","v":{"v":218,"d":"218 B"}}]
[null,null,1.6,6,"m",{"$nulls":3},"mn",{"v":0,"d":"0Lmn"},null,{"$f":"IF(G12=0,\"\",IF(L20=\"il manque\",\"\",IF(L24>21,\"\",IF(D23*F23*H23=0,\"\",D23))))","v":{"v":12,"d":"12 L"}},{"$f":"IF(G12=0,\"\",IF(L20=\"il manque\",\"\",IF(L24>21,\"\",IF(D23*F23*H23=0,\"\",F23))))","v":1},{"$f":"IF(G12=0,\"\",IF(L20=\"il manque\",\"\",IF(L24>21,\"\",IF(D23*F23*H23=0,\"\",H23))))","v":{"v":207,"d":"207 B"}},{"v":1,"d":"1 panne"}]
[null,null,1.8,8,"m",{"$nulls":3},"mn",{"v":0,"d":"0Lmn"},null,{"$f":"IF(G12=0,\"\",IF(L20=\"il manque\",\"\",IF(L24>21,\"\",IF(D24*F24*H24=0,\"\",D24))))","v":""},{"$f":"IF(G12=0,\"\",IF(L20=\"il manque\",\"\",IF(L24>20,\"\",IF(D24*F24*H24=0,\"\",F24))))","v":""},{"$f":"IF(G12=0,\"\",IF(L20=\"il manque\",\"\",IF(L24>21,\"\",IF(D24*F24*H24=0,\"\",H24))))","v":""}]
[null,null,2,10,"m",{"$nulls":3},"mn",{"v":0,"d":"0Lmn"},null,{"$f":"IF(G12=0,\"\",IF(L20=\"il manque\",\"\",IF(L24>21,\"\",IF(N40<0,\"\",IF(O35+O36+O37+O38>=2,\"Si pannes,\",IF(O35+O36+O37+O38=1,\"Si 1 panne,\",\"Sans panne,\"))))))","v":"Si 1 panne,"},null,{"$f":"IF(G12=0,\"\",IF(L20=\"il manque\",\"\",IF(L24>21,\"\",IF(N40<0,\"il manquerait\",\"  il resterait\"))))","v":"  il resterait"}]
[null,null,2.2,12,"m",{"$nulls":3},"mn",{"v":0,"d":"0Lmn"},null,{"$f":"IF(L20=\"il manque\",\"\",\"Règle  1 /\")","v":"Règle  1 /"},{"$f":"IF(L20=\"il manque\",\"\",L15)","v":3},{"$f":"IF(G12=0,\"\",IF(L24>21,\"\",IF(L20=\"il manque\",\"\",O52-G12)))","v":{"v":1682.666666666667,"d":"1683 Litres"}}]
[null,null,2.4,14,"m",{"$nulls":3},"mn",{"v":0,"d":"0Lmn"},null,{"$f":"IF(L20=\"il manque\",\"\",\"Conso aller\")","v":"Conso aller"},null,{"$f":"IF(G12=0,\"\",IF(L20=\"il manque\",\"\",IF(L24>21,\"\",IF(N40<0,\"pour sortir !\",\"à la sortie !\"))))","v":"à la sortie !"}]
[null,null,2.6,16,"m",{"$nulls":3},"mn",{"v":0,"d":"0Lmn"},null,{"$f":"IF(L20=\"il manque\",\"\",G12)","v":{"v":3333.333333333333,"d":"3333 L"}}]
[null,null,2.8,18,"m",{"$nulls":3},"mn",{"v":0,"d":"0Lmn"},{"$f":"IF(N40=\"\",\"\",IF(N40<0,\"\",IF(G12=0,\"\",IF(OR(O35=1,O36=1,O37=1,O38=1),\"Ces\",\"\"))))","v":"Ces"},{"$f":"IF(N40<0,\"\",IF(OR(O35=1,O36=1,O37=1,O38=1),N40,\"\"))","v":{"v":1682.666666666667,"d":"1683 L"}},{"$f":"IF(N40=\"\",\"\",IF(N40<0,\"\",IF(G12=0,\"\",IF(OR(O35=1,O36=1,O37=1,O38=1),\"permettraient  un  retard  de :\",\"\"))))","v":"permettraient  un  retard  de :"}]
[null,null,3,20,"m",{"$nulls":3},"mn",{"v":0,"d":"0Lmn"},{"$f":"IF(N40=\"\",\"\",IF(N40<0,\"\",IF(G12=0,\"\",IF(OR(O35=1,O36=1,O37=1,O38=1),1/Q44*$N$40,\"\"))))","v":{"v":16.82666666666667,"d":"16.8 mn"}},null,{"$f":"IF(N40=\"\",\"\",IF(N40<0,\"\",IF(G12=0,\"\",IF(OR(O35=1,O36=1,O37=1,O38=1),\"à\",\"\"))))","v":"à"},{"v":30,"d":"30 m"},{"$f":"IF(K44<5,\"  c'est peu !\",\"\")","v":""},null,{"$f":"$D$9*((N44/10)+1)","v":100}]
[null,null,3.2,22,"m",{"$nulls":3},"mn",{"v":0,"d":"0Lmn"}]
[null,null,3.4,24,"m",{"$nulls":3},"mn",{"v":0,"d":"0Lmn"},null," 3/3 ou 3/4",null," - 1/3 ou-1/4 reste","retour"]
[null,null,3.6,26,"m",{"$nulls":3},"mn",{"v":0,"d":"0Lmn"},null,{"$f":"A20","v":3600},{"$f":"F20","v":2},{"$f":"L47-L47/$L$15","v":2400},{"$f":"IF(O35=1,N47-(N47/M47),N47)","v":2400}]
[null,null,3.8,28,"m",{"$nulls":3},"mn",{"v":0,"d":"0Lmn"},null,{"$f":"A22","v":3924},{"$f":"F22","v":2},{"$f":"L48-L48/$L$15","v":2616},{"$f":"IF(O36=1,N48-(N48/M48),N48)","v":2616}]
[null,null,4,30,"m",{"$nulls":3},"mn",{"v":0,"d":"0Lmn"},null,{"$f":"A23","v":2484},{"$f":"F23","v":1},{"$f":"L49-L49/$L$15","v":1656},{"$f":"IF(O37=1,N49-(N49/M49),N49)","v":0}]
[null,null,4.2,32,"m",{"$nulls":3},"mn",{"v":0,"d":"0Lmn"},null,{"$f":"A24","v":0},{"$f":"F24","v":0},{"$f":"L50-L50/$L$15","v":0},{"$f":"IF(O38=1,N50-(N50/M50),N50)","v":0}]
[null,null,4.4,34,"m",{"$nulls":3},"mn",{"v":0,"d":"0Lmn"}]
[null,null,4.6,36,"m",{"$nulls":3},"mn",{"v":0,"d":"0Lmn"},null,{"$f":"SUM(L47:L51)","v":10008},null,{"$f":"SUM(N47:N50)","v":6672},{"$f":"SUM(O47:O50)","v":5016}]
[null,null,4.8,38,"m",{"$nulls":3},"mn",{"v":0,"d":"0Lmn"}]
[null,null,5,40,"m",{"$nulls":3},"mn",{"v":0,"d":"0Lmn"}]
[null,null,5.2,42,"m",{"$nulls":3},"mn",{"v":0,"d":"0Lmn"}]
[null,null,5.4,44,"m",{"$nulls":3},"mn",{"v":0,"d":"0Lmn"}]
[null,null,5.6,46,"m",{"$nulls":3},"mn",{"v":0,"d":"0Lmn"}]
[null,null,5.8,48,"m",{"$nulls":3},"mn",{"v":0,"d":"0Lmn"}]
[null,null,6,50,"m",{"$nulls":3},"mn",{"v":0,"d":"0Lmn"}]
[null,null,6.2,52,"m",{"$nulls":3},"mn",{"v":0,"d":"0Lmn"}]
[null,null,6.4,54,"m",{"$nulls":3},"mn",{"v":0,"d":"0Lmn"}]
[null,null,6.6,56,"m",{"$nulls":3},"mn",{"v":0,"d":"0Lmn"}]
[null,null,6.8,58,"m",{"$nulls":3},"mn",{"v":0,"d":"0Lmn"}]
[null,null,7,60,"m",{"$nulls":3},"mn",{"v":0,"d":"0Lmn"}]
[null,null,7.2,62,"m",{"$nulls":3},"mn",{"v":0,"d":"0Lmn"}]
[null,null,7.4,64,"m",{"$nulls":3},"mn",{"v":0,"d":"0Lmn"}]
[null,null,7.6,66,"m",{"$nulls":3},"mn",{"v":0,"d":"0Lmn"}]
[null,null,7.8,68,"m",{"$nulls":3},"mn",{"v":0,"d":"0Lmn"}]
[null,null,8,70,"m",{"$nulls":3},"mn",{"v":0,"d":"0Lmn"}]
[null,null,8.2,72,"m",{"$nulls":3},"mn",{"v":0,"d":"0Lmn"}]
[null,null,8.4,74,"m",{"$nulls":3},"mn",{"v":0,"d":"0Lmn"}]
[null,null,8.6,76,"m",{"$nulls":3},"mn",{"v":0,"d":"0Lmn"}]
[null,null,8.8,78,"m",{"$nulls":3},"mn",{"v":0,"d":"0Lmn"}]
[null,null,9,80,"m",{"$nulls":3},"mn",{"v":0,"d":"0Lmn"}]
[null,null,9.2,82,"m",{"$nulls":3},"mn",{"v":0,"d":"0Lmn"}]
[null,null,9.4,84,"m",{"$nulls":3},"mn",{"v":0,"d":"0Lmn"}]
[null,null,9.6,86,"m",{"$nulls":3},"mn",{"v":0,"d":"0Lmn"}]
[null,null,9.8,88,"m",{"$nulls":3},"mn",{"v":0,"d":"0Lmn"}]
[null,null,10,90,"m",{"$nulls":3},"mn",{"v":0,"d":"0Lmn"}]
[null,null,10.2,92,"m",{"$nulls":3},"mn",{"v":0,"d":"0Lmn"}]
[null,null,10.4,94,"m",{"$nulls":3},"mn",{"v":0,"d":"0Lmn"}]
[null,null,10.6,96,"m",{"$nulls":3},"mn",{"v":0,"d":"0Lmn"}]
[null,null,10.8,98,"m",{"$nulls":3},"mn",{"v":0,"d":"0Lmn"}]
[null,null,11,100,"m",{"$nulls":3},"mn",{"v":0,"d":"0Lmn"}]
[null,null,11.2,102,"m",{"$nulls":3},"mn",{"v":0,"d":"0Lmn"}]
[null,null,11.4,104,"m",{"$nulls":3},"mn",{"v":0,"d":"0Lmn"}]
[null,null,11.6,106,"m",{"$nulls":3},"mn",{"v":0,"d":"0Lmn"}]
[null,null,11.8,108,"m",{"$nulls":3},"mn",{"v":0,"d":"0Lmn"}]
[null,null,12,110,"m",{"$nulls":3},"mn",{"v":0,"d":"0Lmn"}]
[null,null,12.2,112,"m",{"$nulls":3},"mn",{"v":0,"d":"0Lmn"}]
[null,null,12.4,114,"m",{"$nulls":3},"mn",{"v":0,"d":"0Lmn"}]
[null,null,12.6,116,"m",{"$nulls":3},"mn",{"v":0,"d":"0Lmn"}]
[null,null,12.8,118,"m",{"$nulls":3},"mn",{"v":0,"d":"0Lmn"}]
[null,null,13,120,"m",{"$nulls":3},"mn",{"v":0,"d":"0Lmn"}]
[null,null,13.2,122,"m",{"$nulls":3},"mn",{"v":0,"d":"0Lmn"}]
[null,null,13.4,124,"m",{"$nulls":3},"mn",{"v":0,"d":"0Lmn"}]
[null,null,13.6,126,"m",{"$nulls":3},"mn",{"v":0,"d":"0Lmn"}]
[null,null,13.8,128,"m",{"$nulls":3},{"$f":"IF($M$163>$J$4,\"stop !\",\"mn\")","v":"mn"},{"$f":"$D$9*C98*G98","v":{"v":0,"d":"0Lmn"}}]
[null,null,14,130,"m",{"$nulls":3},"mn",{"v":0,"d":"0Lmn"}]
[null,null,14.2,132,"m",{"$nulls":3},"mn",{"v":0,"d":"0Lmn"}]
[null,null,14.4,134,"m",{"$nulls":3},"mn",{"v":0,"d":"0Lmn"}]
[null,null,14.6,136,"m",{"$nulls":3},"mn",{"v":0,"d":"0Lmn"}]
[null,null,14.8,138,"m",{"$nulls":3},"mn",{"v":0,"d":"0Lmn"}]
[null,null,15,140,"m",{"$nulls":3},"mn",{"v":0,"d":"0Lmn"}]
[null,null,15.2,142,"m",{"$nulls":3},"mn",{"v":0,"d":"0Lmn"}]
[null,null,15.4,144,"m",{"$nulls":3},"mn",{"v":0,"d":"0Lmn"}]
[null,null,15.6,146,"m",{"$nulls":3},"mn",{"v":0,"d":"0Lmn"}]
[null,null,15.8,148,"m",{"$nulls":3},"mn",{"v":0,"d":"0Lmn"}]
[null,null,16,150,"m",{"$nulls":3},"mn",{"v":0,"d":"0Lmn"}]
[null,null,16.2,152,"m",{"$nulls":3},"mn",{"v":0,"d":"0Lmn"}]
[null,null,16.4,154,"m",{"$nulls":3},"mn",{"v":0,"d":"0Lmn"}]
[null,null,16.6,156,"m",{"$nulls":3},"mn",{"v":0,"d":"0Lmn"}]
[null,null,16.8,158,"m",{"$nulls":3},"mn",{"v":0,"d":"0Lmn"}]
[null,null,17,160,"m",{"$nulls":3},"mn",{"v":0,"d":"0Lmn"}]
[null,null,17.2,162,"m",{"$nulls":3},"mn",{"v":0,"d":"0Lmn"}]
[null,null,17.4,164,"m",{"$nulls":3},"mn",{"v":0,"d":"0Lmn"}]
[null,null,17.6,166,"m",{"$nulls":3},"mn",{"v":0,"d":"0Lmn"}]
[null,null,17.8,168,"m",{"$nulls":3},"mn",{"v":0,"d":"0Lmn"}]
[null,null,18,170,"m",{"$nulls":3},"mn",{"v":0,"d":"0Lmn"}]
[null,null,18.2,172,"m",{"$nulls":3},"mn",{"v":0,"d":"0Lmn"}]
[null,null,18.4,174,"m",{"$nulls":3},"mn",{"v":0,"d":"0Lmn"}]
[null,null,18.6,176,"m",{"$nulls":3},"mn",{"v":0,"d":"0Lmn"}]
[null,null,18.8,178,"m",{"$nulls":3},"mn",{"v":0,"d":"0Lmn"}]
[null,null,19,180,"m",{"$nulls":3},"mn",{"v":0,"d":"0Lmn"}]
[null,null,19.2,182,"m",{"$nulls":3},"mn",{"v":0,"d":"0Lmn"}]
[null,null,19.4,184,"m",{"$nulls":3},"mn",{"v":0,"d":"0Lmn"}]
[null,null,19.6,186,"m",{"$nulls":3},"mn",{"v":0,"d":"0Lmn"}]
[null,null,19.8,188,"m",{"$nulls":3},"mn",{"v":0,"d":"0Lmn"}]
[null,null,20,190,"m",{"$nulls":3},"mn",{"v":0,"d":"0Lmn"}]
[null,null,20.2,192,"m",{"$nulls":3},"mn",{"v":0,"d":"0Lmn"}]
[null,null,20.4,194,"m",{"$nulls":3},"mn",{"v":0,"d":"0Lmn"}]
[null,null,20.6,196,"m",{"$nulls":3},"mn",{"v":0,"d":"0Lmn"}]
[null,null,20.8,198,"m",{"$nulls":3},"mn",{"v":0,"d":"0Lmn"}]
[null,null,21,200,"m",{"$nulls":3},"mn",{"v":0,"d":"0Lmn"}]
[null,null,21.2,202,"m",{"$nulls":3},"mn",{"v":0,"d":"0Lmn"}]
[null,null,21.4,204,"m",{"$nulls":3},"mn",{"v":0,"d":"0Lmn"}]
[null,null,21.6,206,"m",{"$nulls":3},"mn",{"v":0,"d":"0Lmn"}]
[null,null,21.8,208,"m",{"$nulls":3},"mn",{"v":0,"d":"0Lmn"}]
[null,null,22,210,"m",{"$nulls":3},"mn",{"v":0,"d":"0Lmn"}]
[null,null,22.2,212,"m",{"$nulls":3},"mn",{"v":0,"d":"0Lmn"}]
[null,null,22.4,214,"m",{"$nulls":3},"mn",{"v":0,"d":"0Lmn"}]
[null,null,22.6,216,"m",{"$nulls":3},"mn",{"v":0,"d":"0Lmn"}]
[null,null,22.8,218,"m",{"$nulls":3},"mn",{"v":0,"d":"0Lmn"}]
[null,null,23,220,"m",{"$nulls":3},"mn",{"v":0,"d":"0Lmn"}]
[null,null,23.2,222,"m",{"$nulls":3},"mn",{"v":0,"d":"0Lmn"}]
[null,null,23.4,224,"m",{"$nulls":3},"mn",{"v":0,"d":"0Lmn"}]
[null,null,23.6,226,"m",{"$nulls":3},"mn",{"v":0,"d":"0Lmn"}]
[null,null,23.8,228,"m",{"$nulls":3},"mn",{"v":0,"d":"0Lmn"}]
[null,null,24,230,"m",{"$nulls":3},"mn",{"v":0,"d":"0Lmn"}]
[null,null,24.2,232,"m",{"$nulls":3},"mn",{"v":0,"d":"0Lmn"}]
[null,null,24.4,234,"m",{"$nulls":3},"mn",{"v":0,"d":"0Lmn"}]
[null,null,24.6,236,"m",{"$nulls":3},"mn",{"v":0,"d":"0Lmn"}]
[null,null,24.8,238,"m",{"$nulls":3},"mn",{"v":0,"d":"0Lmn"}]
[null,null,25,240,"m",{"$nulls":3},"mn",{"v":0,"d":"0Lmn"}]
[null,null,25.2,242,"m",{"$nulls":3},"mn",{"v":0,"d":"0Lmn"}]
[null,null,25.4,244,"m",{"$nulls":3},"mn",{"v":0,"d":"0Lmn"}]
[null,null,25.6,246,"m",{"$nulls":3},"mn",{"v":0,"d":"0Lmn"}]
[null,null,25.8,248,"m",{"$nulls":3},"mn",{"v":0,"d":"0Lmn"}]
[null,null,26,250,"m",{"$nulls":3},"mn",{"v":0,"d":"0Lmn"}]
[null,null,26.2,252,"m",{"$nulls":3},"mn",{"v":0,"d":"0Lmn"}]
[null,null,26.4,254,"m",{"$nulls":3},"mn",{"v":0,"d":"0Lmn"}]
[null,null,26.6,256,"m",{"$nulls":3},{"$f":"IF($M$163>$J$4,\"stop !\",\"mn\")","v":"mn"},{"$f":"$D$9*C162*G162","v":{"v":0,"d":"0Lmn"}}]
[null,null,26.8,258,"m",{"$nulls":3},"mn",{"v":0,"d":"0Lmn"}]
[null,null,27,260,"m",{"$nulls":3},"mn",{"v":0,"d":"0Lmn"}]
[null,null,27.2,262,"m",{"$nulls":3},"mn",{"v":0,"d":"0Lmn"}]
[null,null,27.4,264,"m",{"$nulls":3},"mn",{"v":0,"d":"0Lmn"}]
[null,null,27.6,266,"m",{"$nulls":3},"mn",{"v":0,"d":"0Lmn"}]
[null,null,27.8,268,"m",{"$nulls":3},"mn",{"v":0,"d":"0Lmn"}]
[null,null,28,270,"m",{"$nulls":3},"mn",{"v":0,"d":"0Lmn"}]
[null,null,28.2,272,"m",{"$nulls":3},"mn",{"v":0,"d":"0Lmn"}]
[null,null,28.4,274,"m",{"$nulls":3},"mn",{"v":0,"d":"0Lmn"}]
[null,null,28.6,276,"m",{"$nulls":3},"mn",{"v":0,"d":"0Lmn"}]
[null,null,28.8,278,"m",{"$nulls":3},"mn",{"v":0,"d":"0Lmn"}]
[null,null,29,280,"m",{"$nulls":3},"mn",{"v":0,"d":"0Lmn"}]
[null,null,29.2,282,"m",{"$nulls":3},"mn",{"v":0,"d":"0Lmn"}]
[null,null,29.4,284,"m",{"$nulls":3},"mn",{"v":0,"d":"0Lmn"}]
[null,null,29.6,286,"m",{"$nulls":3},"mn",{"v":0,"d":"0Lmn"}]
[null,null,29.8,288,"m",{"$nulls":3},"mn",{"v":0,"d":"0Lmn"}]
[null,null,30,290,"m",{"$nulls":3},"mn",{"v":0,"d":"0Lmn"}]
[null,null,30.2,292,"m",{"$nulls":3},"mn",{"v":0,"d":"0Lmn"}]
[null,null,30.4,294,"m",{"$nulls":3},"mn",{"v":0,"d":"0Lmn"}]
[null,null,30.6,296,"m",{"$nulls":3},"mn",{"v":0,"d":"0Lmn"}]
[null,null,30.8,298,"m",{"$nulls":3},"mn",{"v":0,"d":"0Lmn"}]
[null,null,31,300,"m",{"$nulls":3},"mn",{"v":0,"d":"0Lmn"}]
[{"$nulls":6},{"$f":"SUM(G34:G184)","v":0},null,null,{"$f":"SUM(J33:J184)","v":0}]

{"sheet":"7bis","index":10,"n_rows":183,"n_cols":23,"rows_kept":183,"merged":[[3,4,3,6],[4,4,4,6],[12,11,12,12],[12,16,12,19],[13,16,13,19],[18,4,18,6],[19,4,19,6],[34,4,34,6],[35,4,35,6],[45,12,45,13],[45,16,45,19],[46,16,46,19],[49,4,49,6],[50,4,50,6],[64,2,64,6],[65,2,65,6],[72,12,72,13],[72,16,72,19],[73,16,73,19],[76,2,76,6],[89,4,89,6],[99,12,99,13],[99,16,99,19],[100,16,100,19],[104,4,104,6],[128,12,128,13],[128,16,128,19],[129,16,129,19],[156,11,156,17],[157,11,157,17],[158,11,158,17],[178,12,178,17],[179,12,179,17],[180,12,180,17],[181,12,181,17],[182,12,182,17],[188,16,188,19],[189,12,189,13],[189,16,189,19],[190,16,190,19],[192,4,192,6],[194,4,194,6]]}
[]
[]
[{"$nulls":4},"Règle des 1/3",{"$nulls":11},"Retour après"]
[{"$nulls":4},"BI  2x10 L",{"$nulls":11},"avoir consommé"]
[{"$nulls":4},"210 Bars",{"$nulls":11},"1/3 sur chaque bouteille"]
[]
[{"$nulls":4},70,null,70,{"$nulls":12},"   J'ai consommé 1/3 de chaque bouteille (soit 2/3) et je retourne."]
[{"$nulls":4},70,null,70,{"$nulls":9},70,null,70,"   Si une des 2 bouteilles est en panne, il reste l'autre"]
[{"$nulls":4},70,null,70,{"$nulls":9},70,null,70,"   avec 2/3 pour rentrer . C'est vraiment limite…!"]
[{"$nulls":4},210,null,210,{"$nulls":9},{"$f":"SUM(Q8:Q9)","v":140},null,{"$f":"SUM(S8:S9)","v":140}]
[]
[]
[{"$nulls":16},"EXEMPLE  1"]
[{"$nulls":16},"bouteilles identiques"]
[]
[]
[]
[{"$nulls":4},"Règle des 1/4",{"$nulls":11},"Retour après"]
[{"$nulls":4},"BI  2x10 L",{"$nulls":11},"avoir consommé"]
[{"$nulls":4},"210 Bars",{"$nulls":11},"1/4 sur chaque bouteille"]
[]
[{"$nulls":4},52.5,null,52.5,{"$nulls":12},"   J'ai consommé 1/4 de chaque bouteille (soit 2/4) et je retourne."]
[{"$nulls":4},52.5,null,52.5,{"$nulls":9},52.5,null,52.5,"   Si une des 2 bouteilles est en panne, il reste l'autre"]
[{"$nulls":4},52.5,null,52.5,{"$nulls":9},52.5,null,52.5,"   avec 3/4 pour rentrer ."]
[{"$nulls":4},52.5,null,52.5,{"$nulls":9},52.5,null,52.5]
[{"$nulls":4},210,null,210,{"$nulls":9},{"$f":"SUM(Q23:Q25)","v":157.5},null,{"$f":"SUM(S23:S25)","v":157.5}]
[]
[{"$nulls":22},"SUITE"]
[]
[]
[]
[]
[]
[{"$nulls":4},"Règle des 1/3",{"$nulls":11},"Retour après"]
[{"$nulls":4},"TRI  3x10 L",{"$nulls":11},"avoir consommé"]
[{"$nulls":4},"210 Bars",{"$nulls":11},"1/3 sur chaque bouteille"]
[]
[{"$nulls":4},70,null,70,null,70,{"$nulls":10},"   J'ai consommé 1/3 de chaque bouteille (soit 3/3) et je retourne."]
[{"$nulls":4},70,null,70,null,70,{"$nulls":5},70,null,70,null,70,"   Si une des 3 bouteilles est en panne, il reste les 2 autres"]
[{"$nulls":4},70,null,70,null,70,{"$nulls":5},70,null,70,null,70,"   avec 2/3 dans chaque pour rentrer (soit 4/3)"]
[{"$nulls":4},210,null,210,null,210,{"$nulls":5},{"$f":"SUM(O39:O40)","v":140},null,{"$f":"SUM(Q39:Q40)","v":140},null,{"$f":"SUM(S39:S40)","v":140}]
[{"$nulls":14},"On pourrait se dire : pourquoi ne pas vider une des 3 bouteilles et rentrer sur les 2 autres ?"]
[{"$nulls":14},"Dans ce cas là, si une des 2 est en panne, il ne me resterait que 3/3 dans l'autre alors qu'il faut au minimum  "]
[{"$nulls":14},"3/3 pour rentrer.  Ce serait limite... !"]
[]
[{"$nulls":16},"EXEMPLE  2"]
[{"$nulls":16},"bouteilles identiques"]
[]
[{"$nulls":4},"Règle des 1/4",{"$nulls":11},"Retour après"]
[{"$nulls":4},"TRI  3x10 L",{"$nulls":11},"avoir consommé"]
[{"$nulls":4},"210 Bars",{"$nulls":11},"1/4 sur chaque bouteille"]
[]
[{"$nulls":4},52.5,null,52.5,null,52.5,{"$nulls":10},"   J'ai consommé 1/4 de chaque bouteille (soit 3/4) et je retourne."]
[{"$nulls":4},52.5,null,52.5,null,52.5,{"$nulls":5},52.5,null,52.5,null,52.5,"   Si une des 3 bouteilles est en panne, il reste les 2 autres"]
[{"$nulls":4},52.5,null,52.5,null,52.5,{"$nulls":5},52.5,null,52.5,null,52.5,"   avec 3/4 dans chaque pour rentrer (soit 6/4)"]
[{"$nulls":4},52.5,null,52.5,null,52.5,{"$nulls":5},52.5,null,52.5,null,52.5]
[{"$nulls":4},210,null,210,null,210,{"$nulls":5},{"$f":"SUM(O54:O56)","v":157.5},null,{"$f":"SUM(Q54:Q56)","v":157.5},null,{"$f":"SUM(S54:S56)","v":157.5}]
{"$rows_empty":7}
[null,null,"Règle des 1/3",{"$nulls":13},"Retour après"]
[null,null,"QUADRI  4x10 L",{"$nulls":13},"avoir consommé"]
[{"$nulls":4},"210 Bars",{"$nulls":11},"1/3 sur chaque bouteille"]
[]
[null,null,70,null,70,null,70,null,70,{"$nulls":10},"   J'ai consommé 1/3 de chaque bouteille (soit 4/3) et je retourne."]
[null,null,70,null,70,null,70,null,70,{"$nulls":3},70,null,70,null,70,null,70,"   Si une des 4 bouteilles est en panne, il reste les 3 autres"]
[null,null,70,null,70,null,70,null,70,{"$nulls":3},70,null,70,null,70,null,70,"   avec 2/3 dans chaque (soit 6/3)"]
[null,null,210,null,210,null,210,null,210,{"$nulls":3},{"$f":"SUM(M70:M71)","v":140},null,{"$f":"SUM(O70:O71)","v":140},null,{"$f":"SUM(Q70:Q71)","v":140},null,{"$f":"SUM(S70:S71)","v":140}]
[{"$nulls":16},"EXEMPLE  3"]
[{"$nulls":16},"bouteilles identiques"]
[]
[{"$nulls":4},"Règle des 1/4",{"$nulls":11},"Retour après"]
[null,null,"QUADRI  4x10 L",{"$nulls":13},"avoir consommé"]
[{"$nulls":4},"210 Bars",{"$nulls":11},"1/4 sur chaque bouteille"]
[]
[null,null,52.5,null,52.5,null,52.5,null,52.5,{"$nulls":10},"   J'ai consommé 1/4 de chaque bouteille (soit 4/4) ( comme diraient les Bretons !)"]
[null,null,52.5,null,52.5,null,52.5,null,52.5,{"$nulls":3},52.5,null,52.5,null,52.5,null,52.5,"   et je retourne."]
[null,null,52.5,null,52.5,null,52.5,null,52.5,{"$nulls":3},52.5,null,52.5,null,52.5,null,52.5,"   Si une des 4 bouteilles est en panne, il reste les 3 autres"]
[null,null,52.5,null,52.5,null,52.5,null,52.5,{"$nulls":3},52.5,null,52.5,null,52.5,null,52.5,"   avec 3/4 dans chaque (soit 9/4)"]
[null,null,210,null,210,null,210,null,210,{"$nulls":3},{"$f":"SUM(M81:M83)","v":157.5},null,{"$f":"SUM(O81:O83)","v":157.5},null,{"$f":"SUM(Q81:Q83)","v":157.5},null,{"$f":"SUM(S81:S83)","v":157.5}]
[]
[]
[]
[{"$nulls":4},"Règle des 1/3",{"$nulls":11},"Retour après"]
[{"$nulls":4},"TRI  2x10 L + 1X15 L",{"$nulls":11},"avoir consommé",{"$nulls":3},"Là, on va parler en litres !"]
[{"$nulls":4},"210 Bars",{"$nulls":11},"1/3 sur chaque bouteille"]
[{"$nulls":4},"10 L",null,"15 L",null,"10 L",{"$nulls":5},"10 L",null,"15 L",null,"10 L"]
[{"$nulls":4},700,null,1050,null,700,{"$nulls":10},"   J'ai consommé 1/3 de chaque bouteille (soit 700+1050+700 L = 2450 L)"]
[{"$nulls":4},700,null,1050,null,700,{"$nulls":5},700,null,1050,null,700,"   et je retourne."]
[{"$nulls":4},700,null,1050,null,700,{"$nulls":5},700,null,1050,null,700,"   Si la 15 L est en panne, il reste les deux 10 L"]
[{"$nulls":4},{"$f":"SUM(E92:E94)","v":2100},null,{"$f":"SUM(G92:G94)","v":3150},null,{"$f":"SUM(I92:I94)","v":2100},{"$nulls":5},{"$f":"SUM(O92:O94)","v":1400},null,{"$f":"SUM(Q92:Q94)","v":2100},null,{"$f":"SUM(S92:S94)","v":1400},"   avec 2/3 dans chaque pour rentrer (soit 1400+1400 L = 2800 L)"]
[]
[]
[]
[]
[{"$nulls":16},"EXEMPLE  4"]
[{"$nulls":16},"bouteilles différentes"]
[]
[{"$nulls":4},"Règle des 1/4",{"$nulls":11},"Retour après"]
[{"$nulls":4},"TRI  2x10 L + 1X15 L",{"$nulls":11},"avoir consommé"]
[{"$nulls":4},"210 Bars",{"$nulls":11},"1/4 sur chaque bouteille"]
[{"$nulls":4},"10 L",null,"15 L",null,"10 L",{"$nulls":5},"10 L",null,"15 L",null,"10 L"]
[{"$nulls":4},525,null,787,null,525,{"$nulls":10},"   J'ai consommé 1/4 de chaque bouteille (soit 525+787+525 L =1837 L)"]
[{"$nulls":4},525,null,787,null,525,{"$nulls":5},525,null,787,null,525,"   et je retourne."]
[{"$nulls":4},525,null,787,null,525,{"$nulls":5},525,null,787,null,525,"   Si la 15 L est en panne, il reste les deux 10 L"]
[{"$nulls":4},525,null,787,null,525,{"$nulls":5},525,null,787,null,525,"   avec 3/4 dans chaque pour rentrer (soit 1575+1575 L = 3150 L)"]
[{"$nulls":4},{"$f":"SUM(E107:E110)","v":2100},null,{"$f":"SUM(G107:G110)","v":3148},null,{"$f":"SUM(I107:I110)","v":2100},{"$nulls":5},{"$f":"SUM(O108:O110)","v":1575},null,{"$f":"SUM(Q108:Q110)","v":2361},null,{"$f":"SUM(S108:S110)","v":1575}]
[]
[]
[]
[]
[]
[]
[{"$nulls":4},"Règle des 1/3",{"$nulls":9},"Retour après",{"$nulls":5},"Là, on va parler en litres !"]
[null,null,"QUADRI  2x18 L + 2X9 L",{"$nulls":11},"avoir consommé"]
[{"$nulls":4},"210 Bars",{"$nulls":9},"1/3 sur chaque bouteille"]
[null,null,"9 L",null,"18 L",null,"18 L",null,"9 L",{"$nulls":3},"9 L",null,"18 L",null,"18 L",null,"9 L"]
[null,null,630,null,1260,null,1260,null,630,{"$nulls":10},"   J'ai consommé 1/3 de chaque bouteille (soit 630+1260+1260+630 =3780 L) "]
[null,null,630,null,1260,null,1260,null,630,{"$nulls":3},630,null,1260,null,1260,null,630,"   et je retourne."]
[null,null,630,null,1260,null,1260,null,630,{"$nulls":3},630,null,1260,null,1260,null,630,"   Si une des 18 L est en panne, il reste les 3 autres"]
[null,null,{"$f":"SUM(C122:C124)","v":1890},null,{"$f":"SUM(E122:E124)","v":3780},null,{"$f":"SUM(G122:G124)","v":3780},null,{"$f":"SUM(I122:I124)","v":1890},{"$nulls":3},{"$f":"SUM(M123:M124)","v":1260},null,{"$f":"SUM(O123:O124)","v":2520},null,{"$f":"SUM(Q123:Q124)","v":2520},null,{"$f":"SUM(S123:S124)","v":1260},"   avec 2/3 dans chaque (soit 1260+2520+1260 = 5040 L)"]
[]
[]
[]
[{"$nulls":16},"EXEMPLE  5"]
[{"$nulls":16},"bouteilles différentes"]
[]
[{"$nulls":4},"Règle des 1/4",{"$nulls":9},"Retour après"]
[null,null,"QUADRI  2x18 L + 2X9 L",{"$nulls":11},"avoir consommé"]
[{"$nulls":4},"210 Bars",{"$nulls":9},"1/4 sur chaque bouteille"]
[null,null,"9 L",null,"18 L",null,"18 L",null,"9 L",{"$nulls":3},"9 L",null,"18 L",null,"18 L",null,"9 L"]
[null,null,472,null,945,null,945,null,472,{"$nulls":10},"   J'ai consommé 1/4 de chaque bouteille (soit 472+945+945+472 =2834 L)"]
[null,null,472,null,945,null,945,null,472,{"$nulls":3},472,null,945,null,945,null,472,"   et je retourne."]
[null,null,472,null,945,null,945,null,472,{"$nulls":3},472,null,945,null,945,null,472,"   Si une des 18 L est en panne, il reste les 3 autres"]
[null,null,472,null,945,null,945,null,472,{"$nulls":3},472,null,945,null,945,null,472,"   avec 3/4 dans chaque (soit 1416+2835+1416 = 5667 L)"]
[null,null,{"$f":"SUM(C136:C139)","v":1888},null,{"$f":"SUM(E136:E139)","v":3780},null,{"$f":"SUM(G136:G139)","v":3780},null,{"$f":"SUM(I136:I139)","v":1888},{"$nulls":3},{"$f":"SUM(M137:M139)","v":1416},null,{"$f":"SUM(O137:O139)","v":2835},null,{"$f":"SUM(Q137:Q139)","v":2835},null,{"$f":"SUM(S137:S139)","v":1416}]
[]
[]
[]
[]
[]
[null,null,"Règle des 1/3",{"$nulls":11},"Retour après",{"$nulls":5},"Là, on va parler en litres !"]
[null,null,"TRI  2x7 L + 1X18 L",{"$nulls":11},"avoir consommé"]
[null,null,"210 Bars",{"$nulls":11},"1/3 sur chaque bouteille"]
[null,null,"7 L",null,"18 L",null,"7 L",{"$nulls":5},"7 L",null,"18 L",null,"7 L"]
[null,null,490,null,1260,null,490,{"$nulls":10},"   J'ai consommé 1/3 de chaque bouteille (soit 490+1260+490 L = 2240 L)"]
[null,null,490,null,1260,null,490,{"$nulls":5},490,null,1260,null,490,"   et je retourne."]
[null,null,490,null,1260,null,490,{"$nulls":5},490,null,1260,null,490,"   Si la 18 L est en panne, il reste les deux 7 L"]
[null,null,{"$f":"SUM(C150:C152)","v":1470},null,{"$f":"SUM(E150:E152)","v":3780},null,{"$f":"SUM(G150:G152)","v":1470},{"$nulls":5},{"$f":"SUM(M151:M152)","v":980},null,{"$f":"SUM(O151:O152)","v":2520},null,{"$f":"SUM(Q151:Q152)","v":980},"   avec 2/3 dans chaque pour rentrer (soit 980+980 L = 1960 L)"]
[]
[{"$nulls":10},"PAS ASSEZ POUR RENTRER,   ",{"$nulls":7},"LA REGLE DES TIERS EST A PROSCRIRE DANS CE CAS"]
[]
[{"$nulls":11},"EXEMPLE  6"]
[{"$nulls":11},"bouteilles différentes"]
[{"$nulls":11},"DANGER"]
[]
[null,null,"Règle des 1/4",{"$nulls":11},"Retour après"]
[null,null,"TRI  2x7 L + 1X18 L",{"$nulls":11},"avoir consommé"]
[null,null,"210 Bars",{"$nulls":11},"1/4 sur chaque bouteille"]
[null,null,"7 L",null,"18 L",null,"7 L",{"$nulls":5},"7 L",null,"18 L",null,"7 L"]
[null,null,367,null,945,null,367,{"$nulls":10},"   J'ai consommé 1/4 de chaque bouteille (soit 367+945+367 L = 1679 L)"]
[null,null,367,null,945,null,367,{"$nulls":5},367,null,945,null,367,"   et je retourne."]
[null,null,367,null,945,null,367,{"$nulls":5},367,null,945,null,367,"   Si la 18 L est en panne, il reste les deux 7 L"]
[null,null,367,null,945,null,367,{"$nulls":5},367,null,945,null,367,"   avec 3/4 dans chaque pour rentrer (soit 1101+1101 L = 2202 L)"]
[null,null,{"$f":"SUM(C165:C168)","v":1468},null,{"$f":"SUM(E165:E168)","v":3780},null,{"$f":"SUM(G165:G168)","v":1468},{"$nulls":5},{"$f":"SUM(M166:M168)","v":1101},null,{"$f":"SUM(O166:O168)","v":2835},null,{"$f":"SUM(Q166:Q168)","v":1101}]
[]
[]
[]
[]
[null,null,"210 B",null,"210 B",null,"210 B"]
[null,null,"7 L",null,"18 L",null,"7 L"]
[{"$nulls":4},2300]
[null,null,1470,{"$nulls":3},1470]
[{"$nulls":4},1480]
[null,null,{"$f":"SUM(C176:C178)","v":1470},null,{"$f":"3780-E176","v":1480},null,{"$f":"SUM(G176:G178)","v":1470},{"$nulls":5},"EXEMPLE  7"]
[{"$nulls":12},"EXEMPLE  8"]
[{"$nulls":12},"EXEMPLE  9"]
[{"$nulls":12},"EXEMPLE  10"]
[{"$nulls":12}," ………. "]

{"sheet":"8","index":11,"n_rows":33,"n_cols":33,"rows_kept":33,"merged":[[4,0,4,1],[11,1,11,8],[11,14,11,20],[12,15,12,19],[13,3,13,4],[13,5,13,7],[16,11,16,12],[17,11,17,12],[18,10,20,10],[18,13,20,13],[18,16,20,16],[18,19,20,19],[18,22,20,22],[18,25,20,25],[18,28,20,28],[18,31,20,31],[24,10,24,11],[24,13,24,14],[24,16,24,17],[24,19,24,20],[24,22,24,23],[24,25,24,26],[24,28,24,29],[24,31,24,32],[25,10,26,11],[25,13,26,14],[25,16,26,17],[25,19,26,20],[25,22,26,23],[25,25,26,26],[25,28,26,29],[25,31,26,32],[26,6,26,7],[27,1,28,1],[27,2,28,2],[27,3,27,4],[27,6,28,7],[27,8,28,8],[28,3,31,3],[28,4,31,4],[28,11,28,12],[29,11,30,12],[32,1,33,8]]}
[]
[]
[]
[]
["JP Couloumy"]
[]
[]
[]
[]
[]
[]
[null,"CALCUL DE LA PRESSION D'EQUILIBRE",{"$nulls":12},"O2  PAR  CASCADES"]
[{"$nulls":15},"(Pas très rentable, mais bon !)"]
[null,null,"Air / Air","        O2 / O2",null,"Hé / Hé"]
[{"$nulls":10},"O2",null,null,"O2",null,null,"O2",null,null,"O2",null,null,"O2",null,null,"O2",null,null,"O2",null,null,"O2"]
[{"$nulls":10},"Dans 2ème",null,null,"Dans 3ème",null,null,"Dans 4ème",null,null,"Dans 5ème",null,null,"Dans 6ème",null,null,"Dans 7ème",null,null,"Dans 8ème",null,null,"Dans 9ème"]
[null,null,{"$f":"C25*C21","v":2700},null,"L",{"$f":"F21*F25","v":0},null,{"$f":"C17+F17","v":2700},null,null,"bouteille",null,null,"bouteille",null,null,"bouteille",null,null,"bouteille",null,null,"bouteille",null,null,"bouteille",null,null,"bouteille",null,null,"bouteille"]
[]
[null,null,"     =",null,null," =",{"$nulls":4},{"$f":"C21","v":{"v":18,"d":"18 L"}},"Dans",null,{"$f":"C21","v":{"v":18,"d":"18 L"}},"Dans",null,{"$f":"C21","v":{"v":18,"d":"18 L"}},"Dans",null,{"$f":"C21","v":{"v":18,"d":"18 L"}},"Dans",null,{"$f":"C21","v":{"v":18,"d":"18 L"}},"Dans",null,{"v":50,"d":"50 L"},"Dans",null,{"v":50,"d":"50 L"},"Dans",null,{"v":50,"d":"50 L"},"Dans"]
[{"$nulls":4},"Dans"]
[null,null,18,"Litres","L",3,"Litres",{"$nulls":4},{"v":3,"d":"3 L"},null,null,{"v":20,"d":"20 L"},null,null,{"v":20,"d":"20 L"},null,null,{"v":18,"d":"18 L"},null,null,{"v":18,"d":"18 L"},null,null,{"v":15,"d":"15 L"},null,null,{"v":15,"d":"15 L"},null,null,{"v":10,"d":"10 L"}]
[{"$nulls":10},{"$f":"D29","v":{"v":128.57142857142858,"d":"129 b"}},"à",null,{"$f":"K26","v":{"v":110.20408163265309,"d":"110 b"}},"à",null,{"$f":"N26","v":{"v":110.09667024704619,"d":"110 b"}},"à",null,{"$f":"Q26","v":{"v":104.78263327491662,"d":"105 b"}},"à",null,{"$f":"T26","v":{"v":77.3913166374583,"d":"77 b"}},"à",null,{"$f":"W26","v":{"v":58.69565831872915,"d":"59 b"}},"à",null,{"$f":"Z26","v":{"v":49.76589101440704,"d":"50 b"}},"à",null,{"$f":"AC26","v":{"v":42.89683924185157,"d":"43 b"}},"à"]
[null,null,"      X",null,null,"      X",null,{"$f":"C21+F21","v":21},{"$nulls":3},{"v":0,"d":"0 b"},null,null,{"v":110,"d":"110 b"},null,null,{"v":100,"d":"100 b"},null,null,{"v":50,"d":"50 b"},null,null,{"v":40,"d":"40 b"},null,null,{"v":20,"d":"20 b"},null,null,{"v":20,"d":"20 b"},null,null,{"v":35,"d":"35 b"}]
[]
[null,null,150,"Bars",null,0,"Bars",{"$nulls":3},"pression d'équilbre",null,null,"pression d'équilbre",null,null,"pression d'équilbre",null,null,"pression d'équilbre",null,null,"pression d'équilbre",null,null,"pression d'équilbre",null,null,"pression d'équilbre",null,null,"pression d'équilbre"]
[{"$nulls":10},{"$f":"IF(L21=0,0,((K22*K19)+(L23*L21))/(K19+L21))","v":{"v":110.20408163265309,"d":"110 b"}},null,null,{"$f":"IF(O21=0,0,((N22*N19)+(O23*O21))/(N19+O21))","v":{"v":110.09667024704619,"d":"110 b"}},null,null,{"$f":"IF(R21=0,0,((Q22*Q19)+(R23*R21))/(Q19+R21))","v":{"v":104.78263327491662,"d":"105 b"}},null,null,{"$f":"IF(U21=0,0,((T22*T19)+(U23*U21))/(T19+U21))","v":{"v":77.3913166374583,"d":"77 b"}},null,null,{"$f":"IF(X21=0,0,((W22*W19)+(X23*X21))/(W19+X21))","v":{"v":58.69565831872915,"d":"59 b"}},null,null,{"$f":"IF(AA21=0,0,((Z22*Z19)+(AA23*AA21))/(Z19+AA21))","v":{"v":49.76589101440704,"d":"50 b"}},null,null,{"$f":"IF(AD21=0,0,((AC22*AC19)+(AD23*AD21))/(AC19+AD21))","v":{"v":42.89683924185157,"d":"43 b"}},null,null,{"$f":"IF(AG21=0,0,((AF22*AF19)+(AG23*AG21))/(AF19+AG21))","v":{"v":41.58069936820964,"d":"42 b"}}]
[null," il restera",{"$nulls":4},"il y aura"]
[null,{"$f":"D29*C21","v":{"v":2314.2857142857147,"d":"2314"}},"L","Pression d'équilibre ",null,null,{"$f":"D29*F21","v":{"v":385.7142857142858,"d":"386"}},null,"L"]
[{"$nulls":3},{"$f":"H17/H23","v":128.57142857142858},"Bars"]
[]
[]
[]
[null,{"$f":"IF(C25>300,\"PRESSION  TROP  IMPORTANTE  !!!!\",\"\")","v":""}]

{"sheet":"9","index":12,"n_rows":32,"n_cols":17,"rows_kept":32,"merged":[[0,7,0,9],[1,1,4,17],[6,1,6,17],[6,19,6,20],[6,21,6,22],[7,6,7,7],[7,9,7,10],[7,12,7,13],[7,15,7,16],[8,6,8,7],[8,9,8,10],[8,12,8,13],[8,15,8,16],[10,2,10,4],[10,6,11,7],[10,9,11,10],[10,12,11,13],[10,15,11,16],[11,2,11,4],[12,6,13,6],[12,9,13,9],[12,12,13,12],[12,15,13,15],[12,19,13,19],[12,22,13,22],[14,2,15,4],[14,6,15,7],[14,9,15,10],[14,12,15,13],[14,15,15,16],[17,2,17,4],[17,6,17,7],[17,9,17,10],[17,12,17,13],[17,15,17,16],[18,18,19,18],[18,19,19,19],[18,22,19,22],[18,23,19,23],[19,2,21,4],[21,6,21,7],[21,9,21,10],[21,12,21,13],[21,15,21,16],[21,18,22,18],[21,19,22,19],[21,22,22,22],[21,23,22,23],[23,6,23,7],[23,9,23,10],[23,12,23,13],[23,15,23,16],[25,6,25,7],[25,9,25,10],[25,12,25,13],[25,15,25,16],[26,6,26,7],[26,9,26,10],[26,12,26,13],[26,15,26,16],[27,2,27,4],[27,6,27,7],[27,9,27,10],[27,12,27,13],[27,15,27,16],[27,18,29,19],[27,21,29,22],[27,23,29,23],[30,6,30,9],[30,10,30,12]]}
[]
["JP Couloumy","POIDS   TOTAL  :  Bouteilles + Détendeurs + Gaz"]
[]
[]
[]
[]
[null,"d'un BI, TRI ou QUADRI  bouteilles"]
[{"$nulls":6},"Bouteille",null,null,"Bouteille",null,null,"Bouteille",null,null,"Bouteille"]
[{"$nulls":6},1,null,null,2,null,null,3,null,null,4]
[]
[null,null,"Poids à vide bouteille",{"$nulls":3},{"v":5,"d":"5.0 kg"},null,null,{"v":8,"d":"8.0 kg"},null,null,{"v":10,"d":"10.0 kg"},null,null,{"v":20,"d":"20.0 kg"}]
[null,null,"avec robinet, détendeur"]
[{"$nulls":6},{"$f":"IF(G11=0,\"\",IF(G11>0,IF(G18=0,\"?\",IF(G15=0,\"?\",\"\"))))","v":""},null,null,{"$f":"IF(J11=0,\"\",IF(J11>0,IF(J18=0,\"?\",IF(J15=0,\"?\",\"\"))))","v":""},null,null,{"$f":"IF(M11=0,\"\",IF(M11>0,IF(M18=0,\"?\",IF(M15=0,\"?\",\"\"))))","v":""},null,null,{"$f":"IF(P11=0,\"\",IF(P11>0,IF(P18=0,\"?\",IF(P15=0,\"?\",\"\"))))","v":""}]
[]
[null,null,"Capacité bouteille",{"$nulls":3},{"v":3,"d":"3.0 L"},null,null,{"v":6,"d":"6.0 L"},null,null,{"v":9,"d":"9.0 L"},null,null,{"v":18,"d":"18.0 L"}]
[]
[]
[null,null,"Pression bouteille",{"$nulls":3},{"v":221,"d":"221 b"},null,null,{"v":221,"d":"221 b"},null,null,{"v":221,"d":"221 b"},null,null,{"v":221,"d":"221 b"}]
[{"$nulls":3},"(lire)"]
[null,null,"Gaz dans bouteille en %",{"$nulls":3},"O2","Hé",null,"O2","Hé",null,"O2","Hé",null,"O2","Hé"]
[{"$nulls":6},99,0,null,40,0,null,10.5,50,null,6,94]
[{"$nulls":6},{"$f":"IF(G21=0,\"Erreur !\",IF(G21+H21<21,\"Erreur !\",IF(G21+H21>100,\"Erreur !\",IF(G21+H21=100,\"Héliox\",IF(H21>0,\"Trimix\",IF(G21+H21=21,\"Air\",IF(G21>21,IF(H21=0,\"Nitrox\"))))))))","v":"Nitrox"},null,null,{"$f":"IF(J21=0,\"Erreur !\",IF(J21+K21<21,\"Erreur !\",IF(J21+K21>100,\"Erreur !\",IF(J21+K21=100,\"Héliox\",IF(K21>0,\"Trimix\",IF(J21+K21=21,\"Air\",IF(J21>21,IF(K21=0,\"Nitrox\"))))))))","v":"Nitrox"},null,null,{"$f":"IF(M21=0,\"Erreur !\",IF(M21+N21<21,\"Erreur !\",IF(M21+N21>100,\"Erreur !\",IF(M21+N21=100,\"Héliox\",IF(N21>0,\"Trimix\",IF(M21+N21=21,\"Air\",IF(M21>21,IF(N21=0,\"Nitrox\"))))))))","v":"Trimix"},null,null,{"$f":"IF(P21=0,\"Erreur !\",IF(P21+Q21<21,\"Erreur !\",IF(P21+Q21>100,\"Erreur !\",IF(P21+Q21=100,\"Héliox\",IF(Q21>0,\"Trimix\",IF(P21+Q21=21,\"Air\",IF(P21>21,IF(Q21=0,\"Nitrox\"))))))))","v":"Héliox"}]
[{"$nulls":6},{"$f":"(G15*G18*(G21/100))*1.423/1000","v":{"v":0.9340145100000001,"d":"0.9340"}},{"$f":"(G15*G18*(H21/100))*0.33/1000","v":0},null,{"$f":"(J15*J18*(J21/100))*1.423/1000","v":{"v":0.7547592,"d":"0.7548"}},{"$f":"(J15*J18*(K21/100))*0.33/1000","v":0},null,{"$f":"(M15*M18*(M21/100))*1.423/1000","v":{"v":0.297186435,"d":"0.2972"}},{"$f":"(M15*M18*(N21/100))*0.33/1000","v":0.328185},null,{"$f":"(P15*P18*(P21/100))*1.423/1000","v":{"v":0.33964164,"d":"0.3396"}},{"$f":"(P15*P18*(Q21/100))*0.33/1000","v":1.2339756}]
[{"$nulls":6},{"$f":"(G15*G18*(100-(G21+H21))/1000)*0.1245/10","v":{"v":0.00825435,"d":"0.0083kg"}},null,null,{"$f":"(J15*J18*(100-(J21+K21))/1000)*0.1245/10","v":{"v":0.990522,"d":"0.9905kg"}},null,null,{"$f":"(M15*M18*(100-(M21+N21))/1000)*0.1245/10","v":{"v":0.978140475,"d":"0.9781kg"}},null,null,{"$f":"(P15*P18*(100-(P21+Q21))/1000)*0.1245/10","v":{"v":0,"d":"0.0000kg"}}]
[]
[null,null,"Poids approximatif des gaz",{"$nulls":3},{"$f":"G24+G23+H23","v":{"v":0.9422688600000001,"d":"0.94 kg"}},null,null,{"$f":"J24+J23+K23","v":{"v":1.7452812,"d":"1.75 kg"}},null,null,{"$f":"M24+M23+N23","v":{"v":1.60351191,"d":"1.60 kg"}},null,null,{"$f":"P24+P23+Q23","v":{"v":1.57361724,"d":"1.57 kg"}}]
[{"$nulls":6},{"$f":"IF(G11=0,\"\",IF(G11>0,IF(G15=0,\"?\",IF(G18=0,\"?\",\"\"))))","v":""},null,null,{"$f":"IF(J11=0,\"\",IF(J11>0,IF(J15=0,\"?\",IF(J18=0,\"?\",\"\"))))","v":""},null,null,{"$f":"IF(M11=0,\"\",IF(M11>0,IF(M15=0,\"?\",IF(M18=0,\"?\",\"\"))))","v":""},null,null,{"$f":"IF(P11=0,\"\",IF(P11>0,IF(P15=0,\"?\",IF(P18=0,\"?\",\"\"))))","v":""}]
[null,null,"Poids bouteille pleine",{"$nulls":3},{"$f":"G11+G26","v":{"v":5.94226886,"d":"5.9 kg"}},null,null,{"$f":"J11+J26","v":{"v":9.7452812,"d":"9.7 kg"}},null,null,{"$f":"M11+M26","v":{"v":11.60351191,"d":"11.6 kg"}},null,null,{"$f":"P11+P26","v":{"v":21.57361724,"d":"21.6 kg"}}]
[]
[]
[{"$nulls":6},"Poids total",{"$nulls":3},{"$f":"G28+J28+M28+P28","v":{"v":48.864679210000006,"d":"48.86 kg"}}]
[{"$nulls":4}," "]

{"sheet":"10","index":13,"n_rows":25,"n_cols":14,"rows_kept":25,"merged":[[1,4,2,13],[6,12,6,13],[9,12,9,13],[10,2,11,4],[10,5,11,5],[10,6,11,6],[10,7,11,7],[10,8,11,8],[12,12,12,13],[13,2,14,3],[13,4,14,4],[13,5,14,5],[13,6,14,6],[13,7,14,7],[13,8,14,8],[13,12,13,13],[15,12,15,13],[17,4,17,6],[20,7,20,8]]}
[]
[{"$nulls":4},"Calculs bouteilles paliers et autres"]
[]
[null,"JP Couloumy"]
[]
[]
[{"$nulls":3},"Consos  surface      =",null,15,"  L / mn",{"$nulls":5},"Bars et litres"]
[{"$nulls":12},"Bouteille","Pression"]
[{"$nulls":3},"Profondeur         =",null,21,"m",{"$nulls":5},{"v":18,"d":"18L"},{"v":100,"d":"100 bars"}]
[{"$nulls":12},{"$f":"M9*N9","v":{"v":1800,"d":"1,800L"}}]
[null,null,"Consommation  à  :",null,null,{"$f":"F9","v":21},"   m      =    ",{"$f":"F7*(F9+10)/10","v":46.5}," L / mn"]
[{"$nulls":12},{"$f":"M10","v":{"v":1800,"d":"1,800L"}},"dans bouteille"]
[{"$nulls":12},{"v":9,"d":"9L"}]
[null,null,"POUR",null,28,"mn"," =",{"$f":"IF(E14=\"X\",0,E14*H11)","v":1302},"L ",null,null,"il y aura :",{"$f":"(1/M13)*M10","v":{"v":200,"d":"200 bars"}}]
[]
[{"$nulls":4},"Litres",null,"Bouteille"]
[{"$nulls":4},{"v":1302,"d":"1,302L"},null,{"v":9,"d":"9L"}]
[{"$nulls":4},{"$f":"(1/G17)*E17","v":{"v":144.66666666666666,"d":"145 bars"}}]
[]
[]
[{"$nulls":7},"mémo"]
[]
[]
[]
[{"$nulls":5},"ppppp"]

{"sheet":"11","index":14,"n_rows":188,"n_cols":13,"rows_kept":188,"merged":[[4,12,5,13],[5,0,5,2],[8,4,8,5],[8,7,8,8],[9,4,10,5],[9,7,10,8],[9,10,10,10],[9,12,10,12],[12,4,12,5],[12,7,12,8],[12,9,12,11],[12,12,12,14],[13,4,14,5],[13,7,14,8],[13,9,13,11],[13,12,13,13],[14,9,14,11],[16,3,16,13],[17,5,17,12],[18,6,18,7],[18,9,18,12],[19,1,19,2],[19,6,19,7],[19,9,20,12],[20,1,20,2],[20,6,20,7],[21,6,21,7],[21,9,22,12],[22,6,22,7],[23,6,23,7],[23,9,23,12],[24,6,24,7],[24,9,25,12],[25,6,25,7],[26,6,26,7],[27,10,27,13],[29,4,30,9],[31,4,31,9],[31,10,31,12],[32,4,32,9],[32,10,32,12],[33,4,33,5],[33,6,33,7],[33,10,33,12],[34,5,35,6],[34,7,35,8],[34,9,35,9],[36,7,36,8],[37,7,37,8],[38,7,38,8],[39,7,39,8],[40,7,40,8],[41,7,41,8],[42,7,42,8],[43,7,43,8],[44,7,44,8],[45,7,45,8],[46,7,46,8],[47,7,47,8],[48,7,48,8],[49,7,49,8],[50,7,50,8],[51,7,51,8],[52,7,52,8],[53,7,53,8],[54,7,54,8],[55,7,55,8],[56,7,56,8],[57,7,57,8],[58,7,58,8],[59,7,59,8],[60,7,60,8],[61,7,61,8],[62,7,62,8],[63,7,63,8],[64,7,64,8],[65,7,65,8],[66,7,66,8],[67,7,67,8],[68,7,68,8],[69,7,69,8],[70,7,70,8],[71,7,71,8],[72,7,72,8],[73,7,73,8],[74,7,74,8],[75,7,75,8],[76,7,76,8],[77,7,77,8],[78,7,78,8],[79,7,79,8],[80,7,80,8],[81,7,81,8],[82,7,82,8],[83,7,83,8],[84,7,84,8],[85,7,85,8],[86,7,86,8],[87,7,87,8],[88,7,88,8],[89,7,89,8],[90,7,90,8],[91,7,91,8],[92,7,92,8],[93,7,93,8],[94,7,94,8],[95,7,95,8],[96,7,96,8],[97,7,97,8],[98,7,98,8],[99,7,99,8],[100,7,100,8],[101,7,101,8],[102,7,102,8],[103,7,103,8],[104,7,104,8],[105,7,105,8],[106,7,106,8],[107,7,107,8],[108,7,108,8],[109,7,109,8],[110,7,110,8],[111,7,111,8],[112,7,112,8],[113,7,113,8],[114,7,114,8],[115,7,115,8],[116,7,116,8],[117,7,117,8],[118,7,118,8],[119,7,119,8],[120,7,120,8],[121,7,121,8],[122,7,122,8],[123,7,123,8],[124,7,124,8],[125,7,125,8],[126,7,126,8],[127,7,127,8],[128,7,128,8],[129,7,129,8],[130,7,130,8],[131,7,131,8],[132,7,132,8],[133,7,133,8],[134,7,134,8],[135,7,135,8],[136,7,136,8],[137,7,137,8],[138,7,138,8],[139,7,139,8],[140,7,140,8],[141,7,141,8],[142,7,142,8],[143,7,143,8],[144,7,144,8],[145,7,145,8],[146,7,146,8],[147,7,147,8],[148,7,148,8],[149,7,149,8],[150,7,150,8],[151,7,151,8],[152,7,152,8],[153,7,153,8],[154,7,154,8],[155,7,155,8],[156,7,156,8],[157,7,157,8],[158,7,158,8],[159,7,159,8],[160,7,160,8],[161,7,161,8],[162,7,162,8],[163,7,163,8],[164,7,164,8],[165,7,165,8],[166,7,166,8],[167,7,167,8],[168,7,168,8],[169,7,169,8],[170,7,170,8],[171,7,171,8],[172,7,172,8],[173,7,173,8],[174,7,174,8],[175,7,175,8],[176,7,176,8],[177,7,177,8],[178,7,178,8],[179,7,179,8],[180,7,180,8],[181,7,181,8],[182,7,182,8],[183,7,183,8],[184,7,184,8],[185,7,185,8],[186,7,186,8],[187,7,187,8]]}
[]
[]
[]
[]
[{"$nulls":12},"( bail out)….."]
["JP Couloumy"]
[]
[]
[{"$nulls":4},{"$f":"IF(O14=\"$\",\"conso surface $\",\"conso surface\")","v":"conso surface"},null,null,{"$f":"IF(O14=\"$\",\"\",\"profondeur retour\")","v":"profondeur retour"},null,null,{"$f":"IF(O14=\"$\",\"\",\"vitesse retour\")","v":"vitesse retour"},null,{"$f":"IF(O14=\"$\",\"\",\"distance retour\")","v":"distance retour"}]
[{"$nulls":4},{"v":25,"d":"25 L/mn"},null,null,{"v":20,"d":"20 m"},null,null,{"v":18,"d":"18 m/mn"},null,{"v":400,"d":"400 m"}]
[]
[]
[{"$nulls":4},{"$f":"IF(O14=\"$\",\"temps retour $\",\"temps retour\")","v":"temps retour"},null,null,{"$f":"IF(O14=\"$\",\"conso retour $\",\"consos  retour\")","v":"consos  retour"},null,"(ne servent à rien si multiprofondeur)",null,null,"( si multi profondeurs )"]
[{"$nulls":4},{"$f":"IF(O14=\"$\",H188,(1/K10*M10))","v":{"v":22.22222222222222,"d":"22 mm"}},null,null,{"$f":"IF(O14=\"$\",J188,((H10/10)+1)*E10*E14)","v":{"v":1666.6666666666665,"d":"1667 L"}},null,{"$f":"IF(O14=\"$\",\"Afin d'éviter toutes confusions,\",\"\")","v":""},null,null,"taper    $     ici"]
[{"$nulls":9},{"$f":"IF(O14=\"$\",\"faire suppr dans ces trois cellules jaunes\",\"\")","v":""},null,null,"Entrer la conso surface"]
[{"$nulls":4},{"$f":"IF(O14=\"$\",\"\",IF(E10*H10*K10*M10=0,\"Profil carré, il manque des données !\",\"\"))","v":""},{"$nulls":7},"Puis le profil, puis les bouteilles"]
[{"$nulls":3},"          Bouteilles nécessaires pour le retour"]
["ou là !",{"$nulls":3},"(lire)","avec 1/3 en plus dans chacune (retard, surconsommation)"]
[{"$nulls":4},{"$f":"IF(O14=\"$\",\"Bouteilles $\",\"Bouteilles\")","v":"Bouteilles"},null,{"$f":"IF(O14=\"$\",\"Pression $\",\"Pression\")","v":"Pression"},null,null,{"$f":"IF(B20=0,\"\",IF(B21<B20,\"pas suffisant !\",\"C'est  OK !\"))","v":"pas suffisant !"}]
["A+1/3",{"$f":"(H14*1/3)+H14","v":{"v":2222.222222222222,"d":"2222 L"}},null,{"$f":"E20*G20","v":0},{"v":12,"d":"12 L"},{"$f":"IF($O$14=\"$\",\"$\",\"à\")","v":"à"},{"v":0,"d":"0  Bars"},null,null,{"$f":"IF(B21<B20,\" il manque\",\"\")","v":" il manque"}]
["B",{"$f":"SUM(D20:D27)","v":{"v":0,"d":"0 L"}},null,0,null,{"$f":"IF($O$14=\"$\",\"$\",\"à\")","v":"à"}]
[{"$nulls":3},0,null,"à",{"$nulls":3},{"$f":"IF(B21<B20,B20-B21,\"\")","v":{"v":2222.222222222222,"d":"2222   Litres"}}]
[{"$nulls":3},0,null,"à"]
[{"$nulls":3},0,null,"à",{"$nulls":3},{"$f":"IF(J20=\" il manque\",\"compléter bouteilles et pressions !\",\"\")","v":"compléter bouteilles et pressions !"}]
[{"$nulls":3},0,null,"à",{"$nulls":3},{"$f":"IF(H14=0,\"Il manque des données !!!\",\"\")","v":""}]
[{"$nulls":3},0,null,"à"]
[{"$nulls":3},0,null,"à",{"$nulls":4},{"$f":"IF(J20=\"\",IF(B21>H14,\"… il y a\",\"\"),\"\")","v":""},{"$f":"IF(J20=\"\",B21-B20,\"\")","v":""},{"$f":"IF(J20=\"\",IF(B21>H14,\"L en plus ...\",\"\"),\"\")","v":""}]
[{"$nulls":10},{"$f":"IF(L27<100,\"\",IF(J20=\"\",\"réduire si nécessaire\",\"\"))","v":""}]
["ou ici !"]
[{"$nulls":4},{"$f":"IF(O14=\"$\",\"PROFIL  RETOUR  MULTI  PROFONDEURS  ($)\",\"Tableau pour multi profondeurs (uniquement)\")","v":"Tableau pour multi profondeurs (uniquement)"}]
[]
[{"$nulls":4},{"$f":"IF(O14=\"$\",\"entrer le temps passé aux profondeurs principales\",\"\")","v":""},{"$nulls":5},"( Ne pas oublier $ en O14 )"]
["pour faire défiler le tableau :",{"$nulls":3},{"$f":"IF(O14=\"$\",\"puis compléter le tableau bouteilles et pressions\",\"\")","v":""},{"$nulls":5},"( et contrôler Temps = 0  avant de commencer )"]
["positionner cette ligne vers ",{"$nulls":3},{"$f":"IF(O14=\"$\",\"Conso surface\",\"\")","v":""},null,{"$f":"IF(O14=\"$\",E10,\"\")","v":""},null,{"$f":"IF(O14=\"$\",\"Temps\",\"\")","v":""},{"$f":"IF(O14=\"$\",H188,\"\")","v":""},"Pour mettre temps à 0 : selectionner la ou les"]
["le milieu de la page .",{"$nulls":4},{"$f":"IF(O14=\"$\",\"prof. $\",\"\")","v":""},null,{"$f":"IF(O14=\"$\",\"temps $\",\"\")","v":""},null,null,"              cellules qui ne sont pas à 0 puis faire suppr"]
["puis,"]
["cliquer ici",{"$nulls":3},1,0,"m",null,null,{"$f":"$E$10*H37*E37","v":0}]
["puis, cliquer sur fenêtre",{"$nulls":3},1.2,2,"m",null,null,{"$f":"$E$10*H38*E38","v":0}]
["puis sur figer les volets",{"$nulls":3},1.4,4,"m",null,null,0]
[{"$nulls":4},1.6,6,"m",{"v":0,"d":"0   mm"},null,0]
["pour retourner :",{"$nulls":3},1.8,8,"m",null,null,0]
["fenêtre",{"$nulls":3},2,10,"m",null,null,0]
["libérer les volets",{"$nulls":3},2.2,12,"m",null,null,0]
[{"$nulls":4},2.4,14,"m",null,null,0]
[{"$nulls":4},2.6,16,"m",null,null,0]
[{"$nulls":4},2.8,18,"m",null,null,0]
[{"$nulls":4},3,20,"m",null,null,0]
[{"$nulls":4},3.2,22,"m",null,null,0]
[{"$nulls":4},3.4,24,"m",null,null,0]
[{"$nulls":4},3.6,26,"m",null,null,0]
[{"$nulls":4},3.8,28,"m",null,null,0]
[{"$nulls":4},4,30,"m",null,null,0]
[{"$nulls":4},4.2,32,"m",null,null,0]
[{"$nulls":4},4.4,34,"m",null,null,0]
[{"$nulls":4},4.6,36,"m",null,null,0]
[{"$nulls":4},4.8,38,"m",null,null,0]
[{"$nulls":4},5,40,"m",null,null,0]
[{"$nulls":4},5.2,42,"m",null,null,0]
[{"$nulls":4},5.4,44,"m",null,null,0]
[{"$nulls":4},5.6,46,"m",null,null,0]
[{"$nulls":4},5.8,48,"m",null,null,0]
[{"$nulls":4},6,50,"m",null,null,0]
[{"$nulls":4},6.2,52,"m",null,null,0]
[{"$nulls":4},6.4,54,"m",null,null,0]
[{"$nulls":4},6.6,56,"m",null,null,0]
[{"$nulls":4},6.8,58,"m",null,null,0]
[{"$nulls":4},7,60,"m",null,null,0]
[{"$nulls":4},7.2,62,"m",null,null,0]
[{"$nulls":4},7.4,64,"m",null,null,0]
[{"$nulls":4},7.6,66,"m",null,null,0]
[{"$nulls":4},7.8,68,"m",null,null,0]
[{"$nulls":4},8,70,"m",null,null,0]
[{"$nulls":4},8.2,72,"m",null,null,0]
[{"$nulls":4},8.4,74,"m",null,null,0]
[{"$nulls":4},8.6,76,"m",null,null,0]
[{"$nulls":4},8.8,78,"m",null,null,0]
[{"$nulls":4},9,80,"m",null,null,0]
[{"$nulls":4},9.2,82,"m",null,null,0]
[{"$nulls":4},9.4,84,"m",null,null,0]
[{"$nulls":4},9.6,86,"m",null,null,0]
[{"$nulls":4},9.8,88,"m",null,null,0]
[{"$nulls":4},10,90,"m",null,null,0]
[{"$nulls":4},10.2,92,"m",null,null,0]
[{"$nulls":4},10.4,94,"m",null,null,0]
[{"$nulls":4},10.6,96,"m",null,null,0]
[{"$nulls":4},10.8,98,"m",null,null,0]
[{"$nulls":4},11,100,"m",null,null,0]
[{"$nulls":4},11.2,102,"m",null,null,0]
[{"$nulls":4},11.4,104,"m",null,null,0]
[{"$nulls":4},11.6,106,"m",null,null,0]
[{"$nulls":4},11.8,108,"m",null,null,0]
[{"$nulls":4},12,110,"m",null,null,0]
[{"$nulls":4},12.2,112,"m",null,null,0]
[{"$nulls":4},12.4,114,"m",null,null,0]
[{"$nulls":4},12.6,116,"m",null,null,0]
[{"$nulls":4},12.8,118,"m",null,null,0]
[{"$nulls":4},13,120,"m",null,null,0]
[{"$nulls":4},13.2,122,"m",null,null,0]
[{"$nulls":4},13.4,124,"m",null,null,0]
[{"$nulls":4},13.6,126,"m",null,null,0]
[{"$nulls":4},13.8,128,"m",null,null,0]
[{"$nulls":4},14,130,"m",null,null,{"$f":"$E$10*H102*E102","v":0}]
[{"$nulls":4},14.2,132,"m",null,null,0]
[{"$nulls":4},14.4,134,"m",null,null,0]
[{"$nulls":4},14.6,136,"m",null,null,0]
[{"$nulls":4},14.8,138,"m",null,null,0]
[{"$nulls":4},15,140,"m",null,null,0]
[{"$nulls":4},15.2,142,"m",null,null,0]
[{"$nulls":4},15.4,144,"m",null,null,0]
[{"$nulls":4},15.6,146,"m",null,null,0]
[{"$nulls":4},15.8,148,"m",null,null,0]
[{"$nulls":4},16,150,"m",null,null,0]
[{"$nulls":4},16.2,152,"m",null,null,0]
[{"$nulls":4},16.4,154,"m",null,null,0]
[{"$nulls":4},16.6,156,"m",null,null,0]
[{"$nulls":4},16.8,158,"m",null,null,0]
[{"$nulls":4},17,160,"m",null,null,0]
[{"$nulls":4},17.2,162,"m",null,null,0]
[{"$nulls":4},17.4,164,"m",null,null,0]
[{"$nulls":4},17.6,166,"m",null,null,0]
[{"$nulls":4},17.8,168,"m",null,null,0]
[{"$nulls":4},18,170,"m",null,null,0]
[{"$nulls":4},18.2,172,"m",null,null,0]
[{"$nulls":4},18.4,174,"m",null,null,0]
[{"$nulls":4},18.6,176,"m",null,null,0]
[{"$nulls":4},18.8,178,"m",null,null,0]
[{"$nulls":4},19,180,"m",null,null,0]
[{"$nulls":4},19.2,182,"m",null,null,0]
[{"$nulls":4},19.4,184,"m",null,null,0]
[{"$nulls":4},19.6,186,"m",null,null,0]
[{"$nulls":4},19.8,188,"m",null,null,0]
[{"$nulls":4},20,190,"m",null,null,0]
[{"$nulls":4},20.2,192,"m",null,null,0]
[{"$nulls":4},20.4,194,"m",null,null,0]
[{"$nulls":4},20.6,196,"m",null,null,0]
[{"$nulls":4},20.8,198,"m",null,null,0]
[{"$nulls":4},21,200,"m",null,null,0]
[{"$nulls":4},21.2,202,"m",null,null,0]
[{"$nulls":4},21.4,204,"m",null,null,0]
[{"$nulls":4},21.6,206,"m",null,null,0]
[{"$nulls":4},21.8,208,"m",null,null,0]
[{"$nulls":4},22,210,"m",null,null,0]
[{"$nulls":4},22.2,212,"m",null,null,0]
[{"$nulls":4},22.4,214,"m",null,null,0]
[{"$nulls":4},22.6,216,"m",null,null,0]
[{"$nulls":4},22.8,218,"m",null,null,0]
[{"$nulls":4},23,220,"m",null,null,0]
[{"$nulls":4},23.2,222,"m",null,null,0]
[{"$nulls":4},23.4,224,"m",null,null,0]
[{"$nulls":4},23.6,226,"m",null,null,0]
[{"$nulls":4},23.8,228,"m",null,null,0]
[{"$nulls":4},24,230,"m",null,null,0]
[{"$nulls":4},24.2,232,"m",null,null,0]
[{"$nulls":4},24.4,234,"m",null,null,0]
[{"$nulls":4},24.6,236,"m",null,null,0]
[{"$nulls":4},24.8,238,"m",null,null,0]
[{"$nulls":4},25,240,"m",null,null,0]
[{"$nulls":4},25.2,242,"m",null,null,0]
[{"$nulls":4},25.4,244,"m",null,null,0]
[{"$nulls":4},25.6,246,"m",null,null,0]
[{"$nulls":4},25.8,248,"m",null,null,0]
[{"$nulls":4},26,250,"m",null,null,0]
[{"$nulls":4},26.2,252,"m",null,null,0]
[{"$nulls":4},26.4,254,"m",null,null,0]
[{"$nulls":4},26.6,256,"m",null,null,0]
[{"$nulls":4},26.8,258,"m",null,null,{"$f":"$E$10*H166*E166","v":0}]
[{"$nulls":4},27,260,"m",null,null,0]
[{"$nulls":4},27.2,262,"m",null,null,0]
[{"$nulls":4},27.4,264,"m",null,null,0]
[{"$nulls":4},27.6,266,"m",null,null,0]
[{"$nulls":4},27.8,268,"m",null,null,0]
[{"$nulls":4},28,270,"m",null,null,0]
[{"$nulls":4},28.2,272,"m",null,null,0]
[{"$nulls":4},28.4,274,"m",null,null,0]
[{"$nulls":4},28.6,276,"m",null,null,0]
[{"$nulls":4},28.8,278,"m",null,null,0]
[{"$nulls":4},29,280,"m",null,null,0]
[{"$nulls":4},29.2,282,"m",null,null,0]
[{"$nulls":4},29.4,284,"m",null,null,0]
[{"$nulls":4},29.6,286,"m",null,null,0]
[{"$nulls":4},29.8,288,"m",null,null,0]
[{"$nulls":4},30,290,"m",null,null,0]
[{"$nulls":4},30.2,292,"m",null,null,0]
[{"$nulls":4},30.4,294,"m",null,null,0]
[{"$nulls":4},30.6,296,"m",null,null,0]
[{"$nulls":4},30.8,298,"m",null,null,0]
[{"$nulls":4},31,300,"m",null,null,0]
[{"$nulls":7},{"$f":"SUM(H37:I187)","v":{"v":0,"d":"0   mm"}},null,{"$f":"SUM(J37:J187)","v":0}]

{"sheet":"12","index":15,"n_rows":350,"n_cols":24,"rows_kept":350,"merged":[[9,4,10,10],[13,2,14,7],[14,9,14,11],[15,3,15,6],[15,9,16,9],[15,10,16,10],[15,11,16,11],[16,3,16,6],[17,3,18,3],[17,4,18,4],[17,5,18,5],[18,6,19,6],[18,8,19,8],[19,3,20,3],[19,4,20,4],[19,5,20,5],[20,7,21,7],[20,14,20,16],[21,4,21,5],[22,8,23,11],[24,8,25,9],[24,10,25,10],[24,11,25,11],[28,2,28,7],[36,0,36,2],[39,26,40,26],[41,10,41,14],[42,10,42,14],[43,2,43,4],[43,5,44,5],[43,10,43,14],[44,2,44,4],[44,10,45,14],[44,16,45,16],[46,1,46,4],[46,5,48,5],[46,6,48,6],[46,11,46,13],[47,1,47,4],[47,7,48,8],[47,9,48,12],[47,13,48,13],[47,14,48,15],[47,16,48,17],[48,1,48,4],[49,16,49,17],[50,16,50,17],[51,16,51,17],[52,16,52,17],[53,16,53,17],[54,16,54,17],[55,16,55,17],[56,1,56,5],[57,1,57,5],[58,1,58,5],[59,1,59,5],[60,1,60,5],[61,1,61,5],[62,1,62,5],[63,1,63,5],[64,1,64,5],[65,1,65,5],[66,1,66,5],[67,1,67,5],[68,1,68,5],[69,1,69,5],[70,1,70,5],[71,1,71,5],[72,1,72,5],[73,1,73,5],[74,1,74,5],[75,1,75,5],[76,1,76,5],[77,1,77,5],[78,1,78,5],[79,1,79,5],[80,1,80,5],[81,1,81,5],[82,1,82,5],[83,1,83,5],[84,1,84,5],[85,1,85,5],[86,1,86,5],[87,1,87,5],[88,1,88,5],[89,1,89,5],[90,1,90,5],[91,1,91,5],[92,1,92,5],[93,1,93,5],[94,1,94,5],[95,1,95,5],[96,1,96,5],[97,1,97,5],[98,1,98,5],[99,1,99,5],[100,1,100,5],[101,1,101,5],[102,1,102,5],[103,1,103,5],[104,1,104,5],[105,1,105,5],[106,1,106,5],[107,1,107,5],[108,1,108,5],[109,1,109,5],[110,1,110,5],[111,1,111,5],[112,1,112,5],[113,1,113,5],[114,1,114,5],[115,1,115,5],[116,1,116,5],[117,1,117,5],[118,1,118,5],[119,1,119,5],[120,1,120,5],[121,1,121,5],[122,1,122,5],[123,1,123,5],[124,1,124,5],[125,1,125,5],[126,1,126,5],[127,1,127,5],[128,1,128,5],[129,1,129,5],[130,1,130,5],[131,1,131,5],[132,1,132,5],[133,1,133,5],[134,1,134,5],[135,1,135,5],[136,1,136,5],[137,1,137,5],[138,1,138,5],[139,1,139,5],[140,1,140,5],[141,1,141,5],[142,1,142,5],[143,1,143,5],[144,1,144,5],[145,1,145,5],[146,1,146,5],[147,1,147,5],[148,1,148,5],[149,1,149,5],[150,1,150,5],[151,1,151,5],[152,1,152,5],[153,1,153,5],[154,1,154,5],[155,1,155,5],[156,1,156,5],[157,1,157,5],[158,1,158,5],[159,1,159,5],[160,1,160,5],[161,1,161,5],[162,1,162,5],[163,1,163,5],[164,1,164,5],[165,1,165,5],[166,1,166,5],[167,1,167,5],[168,1,168,5],[169,1,169,5],[170,1,170,5],[171,1,171,5],[172,1,172,5],[173,1,173,5],[174,1,174,5],[175,1,175,5],[176,1,176,5],[177,1,177,5],[178,1,178,5],[179,1,179,5],[180,1,180,5],[181,1,181,5],[182,1,182,5],[183,1,183,5],[184,1,184,5],[185,1,185,5],[186,1,186,5],[187,1,187,5],[188,1,188,5],[189,1,189,5],[190,1,190,5],[191,1,191,5],[192,1,192,5],[193,1,193,5],[194,1,194,5],[195,1,195,5],[196,1,196,5],[197,1,197,5],[198,1,198,5],[199,1,199,5],[200,1,200,5],[201,1,201,5],[202,1,202,5],[203,1,203,5],[204,1,204,5],[205,1,205,5],[206,1,206,5],[207,1,207,5],[208,1,208,5],[209,1,209,5],[210,1,210,5],[211,1,211,5],[212,1,212,5],[213,1,213,5],[214,1,214,5],[215,1,215,5],[216,1,216,5],[217,1,217,5],[218,1,218,5],[219,1,219,5],[220,1,220,5],[221,1,221,5],[222,1,222,5],[223,1,223,5],[224,1,224,5],[225,1,225,5],[226,1,226,5],[227,1,227,5],[228,1,228,5],[229,1,229,5],[230,1,230,5],[231,1,231,5],[232,1,232,5],[233,1,233,5],[234,1,234,5],[235,1,235,5],[236,1,236,5],[237,1,237,5],[238,1,238,5],[239,1,239,5],[240,1,240,5],[241,1,241,5],[242,1,242,5],[243,1,243,5],[244,1,244,5],[245,1,245,5],[246,1,246,5],[247,1,247,5],[248,1,248,5],[249,1,249,5],[250,1,250,5],[251,1,251,5],[252,1,252,5],[253,1,253,5],[254,1,254,5],[255,1,255,5],[256,1,256,5],[257,1,257,5],[258,1,258,5],[259,1,259,5],[260,1,260,5],[261,1,261,5],[262,1,262,5],[263,1,263,5],[264,1,264,5],[265,1,265,5],[266,1,266,5],[267,1,267,5],[268,1,268,5],[269,1,269,5],[270,1,270,5],[271,1,271,5],[272,1,272,5],[273,1,273,5],[274,1,274,5],[275,1,275,5],[276,1,276,5],[277,1,277,5],[278,1,278,5],[279,1,279,5],[280,1,280,5],[281,1,281,5],[282,1,282,5],[283,1,283,5],[284,1,284,5],[285,1,285,5],[286,1,286,5],[287,1,287,5],[288,1,288,5],[289,1,289,5],[290,1,290,5],[291,1,291,5],[292,1,292,5],[293,1,293,5],[294,1,294,5],[295,1,295,5],[296,1,296,5],[297,1,297,5],[298,1,298,5],[299,1,299,5],[300,1,300,5],[301,1,301,5],[302,1,302,5],[303,1,303,5],[304,1,304,5],[305,1,305,5],[306,1,306,5],[307,1,307,5],[308,1,308,5],[309,1,309,5],[310,1,310,5],[311,1,311,5],[312,1,312,5],[313,1,313,5],[314,1,314,5],[315,1,315,5],[316,1,316,5],[317,1,317,5],[318,1,318,5],[319,1,319,5],[320,1,320,5],[321,1,321,5],[322,1,322,5],[323,1,323,5],[324,1,324,5],[325,1,325,5],[326,1,326,5],[327,1,327,5],[328,1,328,5],[329,1,329,5],[330,1,330,5],[331,1,331,5],[332,1,332,5],[333,1,333,5],[334,1,334,5],[335,1,335,5],[336,1,336,5],[337,1,337,5],[338,1,338,5],[339,1,339,5],[340,1,340,5],[341,1,341,5],[342,1,342,5],[343,1,343,5],[344,1,344,5],[345,1,345,5],[346,1,346,5],[347,1,347,5],[348,1,348,5],[349,1,349,5]]}
[null,"Attention :  "]
[]
[null,"L'alarme narcose est réglée pour une Pne de 60m, pour plus de sécurité et pour optimiser la déco, s'en tenir à 30, 35m."]
[null,"Alarme Narcose > 5,53         Alarme Pne élevée >3,56"]
[null,"Alarme hyperoxie de 7 à 43m ( > 1,6 )    de    44 à 170m ( > 1,5 )   de 171 à 300m ( > 1,4 )   "]
[null,"Verrouillage set point haut de 7 à 43 m  ( >1,6 )--------de 44m à 170m  ( >1,5 )--------de 171m à 300m  ( >1,4 )"]
[null,"Les phénomènes de compressibilité des gaz ne sont pas pris en charge dans ce tableur, en tenir compte pour les pressions élevées !"]
[]
[]
[]
["   JP Couloumy"]
[]
[{"$nulls":3},"HELIUM",null,"  OXYGENE",null,null,"NITROX",null,null,"AIR"]
[null,null,{"$f":"IF(K20<0,\"impossible à réaliser par PP\",IF(K21<0,\"impossible à réaliser par PP\",IF(K22<0,\"impossible à réaliser par PP\",\"\")))","v":""}]
[{"$nulls":9},"Fabrication  Héliair"]
[{"$nulls":3},"Diluant désiré",{"$nulls":5},"Hé",{"$f":"(F18/100)*H19","v":170},"B"]
[{"$nulls":3},{"$f":"IF(D18=\"Air\",\"\",IF(E18<21,IF(E18>17.9,\" Héliair < 15%  ?\",\"\")))","v":""},{"$nulls":3},"Pression"]
[{"$nulls":3},{"$f":"IF(F18=0,\"Air\",\"Héliair\")","v":"Héliair"},{"$f":"K31","v":{"v":3.15,"d":"3.2"}},85,null,"désirée",null,"Air",{"$f":"(H19-K16)","v":30},"B",{"$nulls":6},"restante","désirée","rajout"]
[{"$nulls":7},200,null,"Fabrication trimix ( PP )",null,null,{"$f":"K16+K18","v":200},{"$nulls":4},"Pression",0,{"$f":"H19","v":{"v":200,"d":"200.000"}},{"$f":"T19-S19","v":{"v":200,"d":"200.000 "}}]
[{"$nulls":3},{"$f":"IF(E20=100,\"?\",IF(E20+F20=100,\"Héliox\",IF(F20=0,\"Nitrox\",IF(F20>0,\"Trimix\"))))","v":"Trimix"},10.5,50,null,"bars",null,"O2",{"$f":"F24","v":{"v":0,"d":"0.0"}},"B",{"$nulls":5},"% o2",0,{"$f":"E20/100","v":0.105}]
[{"$nulls":7},{"$f":"IF(K20<0,\"?\",\"\")","v":""},null,"Hé",{"$f":"G22","v":{"v":100,"d":"100.0"}},"B",{"$nulls":5},"% Hé",0,{"$f":"(F20/100)","v":{"v":0.5,"d":"0.500"}}]
[null,null,"Hé =",{"$f":"F20","v":{"v":50,"d":"50.0"}},{"$f":"IF(E20+F20>100,\"> à 100 %   !\",\"\")","v":""},null,{"$f":"F20/100*(H19)","v":{"v":100,"d":"100.0"}},null,null,"Air",{"$f":"F25","v":{"v":100,"d":"100.0"}},"B",{"$nulls":5},"% N2",{"$f":"IF(S20=0,0,IF(S21=0,1-S20,1-S20-S21))","v":0},{"$f":"IF(T20=0,0,IF(T21=0,1-T20,IF(T21>0,1-T20-T21)))","v":0.395}]
[null,null,"N2=",{"$f":"(100-F20)-E20","v":39.5},"%",{"$f":"D23/100*(H19)","v":{"v":79,"d":"79.0"}},"bars",null,"Fabrication trimix (stick, tamp)",{"$nulls":8},"PP o2",{"$f":"S19*S20","v":0},{"$f":"T19*T20","v":{"v":21,"d":"21.000"}},{"$f":"T23-S23","v":{"v":21,"d":"21.000 "}}]
[null,null,"O2=",{"$f":"100-(D22+D23)","v":10.5},"%",{"$f":"H27/100*(H19)","v":{"v":0,"d":"0.0"}},"bars",{"$nulls":10},"PP Hé",{"$f":"S19*S21","v":0},{"$f":"T19*T21","v":{"v":100,"d":"100.000"}},{"$f":"T24-S24","v":{"v":100,"d":"100.000 "}}]
[null,null,"Air=",{"$f":"100/79*D23","v":{"v":50,"d":"50.0"}},"%",{"$f":"D25/100*(H19)","v":{"v":100,"d":"100.0"}},"bars",null,"Hé",null,{"$f":"(F20/100)*H19","v":{"v":100,"d":"100.0"}},"B",{"$nulls":5},"PP N2",{"$f":"S19*S22","v":0},{"$f":"T19*T22","v":{"v":79,"d":"79.000"}},{"$f":"T25-S25","v":{"v":79,"d":"79.000 "}}]
[null,null,"O2 air",{"$f":"21/79*D23","v":{"v":10.499999999999998,"d":"10.5"}},"%","stick nitrox"]
[{"$nulls":3},{"$f":"D22+D23+D24","v":{"v":100,"d":"100.0"}},"%",{"$f":"G22+F24+F25","v":200},"bars",{"$f":"D24-D26","v":{"v":0,"d":"0.0"}},"N",100,{"$f":"S29","v":{"v":0,"d":"0.0"}},"B",{"$nulls":5},"O2",{"$f":"J27/100","v":{"v":1,"d":"1.00 "}},null,"O2",{"v":0.21,"d":"21%"}]
[{"$nulls":8},"Air",null,{"$f":"S31","v":{"v":100,"d":"100.0"}},"B",{"$nulls":5}," N2",{"$f":"1-S27","v":0},"tampon "," N2",{"$f":"1-V27","v":{"v":0.79,"d":"79%"}},"compresseur"]
[null,null,{"$f":"IF(K25<0,\"impossible à réaliser avec nitrox\",IF(K27<0,\"impossible à réaliser avec nitrox\",IF(K28<0,\"impossible à réaliser avec nitrox\",\"\")))","v":""},{"$nulls":14},{"$f":"\"Nitrox \"&TEXT(S27*100,0)","v":"Nitrox 100"},{"$f":"(V28*U23-V27*U25)/(S27*V28-S28*V27)","v":0},"bars","O2",{"$f":"S29*S27+S31*V27+S19*S20","v":{"v":21,"d":"21.00"}},"bars",{"$f":"V29/V32","v":{"v":0.105,"d":"11%"}}]
[{"$nulls":11},{"$f":"K20+K21+K22","v":200},{"$nulls":5},"Hélium",{"$f":"U24","v":{"v":100,"d":"100.00 "}},"bars","He",{"$f":"S30+S19*S21","v":{"v":100,"d":"100.00"}},"bars",{"$f":"V30/V32","v":{"v":0.5,"d":"50%"}}]
[{"$nulls":9}," =         Hr",{"$f":"(K18)*(21/100)/(H19)*100","v":{"v":3.15,"d":"3.2"}},{"$f":"K16/H19*100","v":85},{"$nulls":5},"compresseur",{"$f":"(S27*U25-S28*U23)/(S27*V28-S28*V27)","v":{"v":100,"d":"100.00 "}},"bars","N2",{"$f":"S29*S28+S31*V28+S19*S22","v":{"v":79,"d":"79.00"}},"bars",{"$f":"V31/V32","v":{"v":0.395,"d":"40%"}}]
[{"$nulls":10},{"$f":"IF(K22<0,\"Héliox impossible !\",\"\")","v":""},{"$nulls":9},"Total",{"$f":"SUM(V29:V31)","v":{"v":200,"d":"200.00"}},"bars",{"$f":"SUM(X29:X31)","v":{"v":1,"d":"100%"}}]
[{"$nulls":9},"      N2   =",{"$f":"100-(K31+L31)","v":{"v":11.849999999999994,"d":"11.9"}},{"$nulls":11},{"$f":"IF(X29=1,\"Oxygene\",IF(X30>0,\"Trimix \"&TEXT(X29*100,0)&\"/\"&TEXT(X30*100,0),\"Nitrox \"&TEXT(X29*100,0)))","v":"Trimix 11/50"}]
[{"$nulls":9},"Total",{"$f":"K16+K18","v":200},"bars"]
{"$rows_empty":7}
[{"$nulls":4},"lire","lire",{"$nulls":4},"SET POINT   de    0 à 6 m",{"$nulls":5},0.7]
[{"$nulls":10},"SET POINT    de    7 à 43 m",{"$nulls":5},0.7]
[null,null,"Si paliers (6 à 0m) à l'02",null,null,0,{"$nulls":4},"SET POINT    de    44 à 170 m",{"$nulls":5},1.3]
[null,null,"TAPER  oxy",{"$nulls":7},"SET POINT    de    171 à 300 m",{"$nulls":5},1.3]
[]
[null,"Pour voir rinçage diluant ou",{"$nulls":3},"oc","F47",null," Dil ",null,"Diluant",{"$f":"IF(E20=21,IF(D20=\"Nitrox\",\"AIR\"),D20)","v":"Trimix"},null,null,{"$f":"E20","v":10.5},null,{"$f":"F20","v":50},{"$f":"100-(O47+Q47)","v":39.5},"coef = Hé / N2",{"$f":"Q47/R47","v":{"v":1.2658227848101267,"d":"1.266"}}]
[null,"passage en circuit ouvert",{"$nulls":5},"     Prof",null,"           Prof.          set point    PPN2",{"$nulls":3},"  %O2","Pne      Ppge",null,"   DANGER"]
[1,"(TAPER  OC)",{"$nulls":16},",% 02","Hé+N2=","% N2 =",", % Hé"]
["clic",{"$nulls":6},{"v":0,"d":"0 m"},null,0,{"$f":"IF($F$44=\"oxy\",\"m\",IF(L50>1,\"   Pa  <  à\",\"m\"))","v":"m"},{"$f":"IF($F$44=\"oxy\",\"02\",$Q$42)","v":{"v":0.7,"d":"0.70"}},{"$f":"IF(L50=\"02\",\"\",IF($R$47=0,0,U50*A49/100))","v":{"v":0.1324022346368715,"d":"0.13"}},{"$f":"IF($F$44=\"oxy\",1,S50/100)","v":{"v":0.7,"d":"70.00%"}},{"$f":"IF(M50=\"\",\"\",IF(M50<0.79,0,(10*M50)/0.79-7.9/0.79))","v":{"v":0,"d":"0 m"}},"lire",{"$f":"IF($Q$42<=0.16,\"hypoxie\",IF(K50=\"   Pa  <  à\",\"impossible\",\"\"))","v":""},null,{"$f":"$Q$42/A49*100","v":{"v":70,"d":"70.00 "}},{"$f":"100-S50","v":{"v":30,"d":"30.000"}},{"$f":"T50/($T$47+1)","v":{"v":13.240223463687151,"d":"13.240 "}},{"$f":"100-(S50+U50)","v":{"v":16.75977653631284,"d":"16.760 "}},{"$f":"V50+U50+S50","v":{"v":100,"d":"100 "}}]
[1.1,{"$nulls":6},{"v":1,"d":"1 m"},null,1,{"$f":"IF($F$44=\"oxy\",\"m\",IF(L51>1.1,\"   Pa  <  à\",\"m\"))","v":"m"},{"v":0.7,"d":"0.70"},{"$f":"IF(L51=\"02\",\"\",IF($R$47=0,0,U51*A51/100))","v":{"v":0.17653631284916207,"d":"0.18"}},{"v":0.6363636363636362,"d":"63.64%"},{"$f":"IF(M51=\"\",\"\",IF(M51<0.79,0,(10*M51)/0.79-7.9/0.79))","v":{"v":0,"d":"0 m"}},{"$f":"IF(P52<=0,0,IF(J51=\"OC ou\",(((((($E$20%*1.428)+($F$20%*0.178)+($D$23%*1.25))*A51))/1.28738)*10)-10,((((((S51%*1.428)+(V51%*0.178)+(U51%*1.25))*A51))/1.28738)*10)-10))","v":{"v":-0.21231549834313412,"d":"-0 m"}},"",null,{"$f":"$Q$42/A51*100","v":{"v":63.636363636363626,"d":"63.64 "}},{"v":36.363636363636374,"d":"36.364"},{"v":16.048755713560187,"d":"16.049 "},{"$f":"100-(S51+U51)","v":{"v":20.31488065007619,"d":"20.315 "}},{"$f":"V51+U51+S51","v":{"v":100,"d":"100 "}}]
[1.2,{"$nulls":6},{"v":2,"d":"2 m"},null,2,{"$f":"IF($F$44=\"oxy\",\"m\",IF(L52>1.2,\"   Pa  <  à\",\"m\"))","v":"m"},{"v":0.7,"d":"0.70"},{"v":0.22067039106145248,"d":"0.22"},{"v":0.5833333333333334,"d":"58.33%"},{"v":0,"d":"0 m"},{"$f":"IF(P53<=0,0,IF(J52=\"OC ou\",(((((($E$20%*1.428)+($F$20%*0.178)+($D$23%*1.25))*A52))/1.28738)*10)-10,((((((S52%*1.428)+(V52%*0.178)+(U52%*1.25))*A52))/1.28738)*10)-10))","v":{"v":0.2934538303987715,"d":"0 m"}},"",null,{"v":58.333333333333336,"d":"58.33 "},{"v":41.666666666666664,"d":"41.667"},{"v":18.389199255121042,"d":"18.389 "},{"v":23.277467411545615,"d":"23.277 "},{"v":100,"d":"100 "}]
[1.3,{"$nulls":6},{"v":3,"d":"3 m"},null,3,{"$f":"IF($F$44=\"oxy\",\"m\",IF(L53>1.3,\"   Pa  <  à\",\"m\"))","v":"m"},{"v":0.7,"d":"0.70"},{"v":0.264804469273743,"d":"0.26"},{"v":0.5384615384615384,"d":"53.85%"},{"v":0,"d":"0 m"},{"v":0.7992231591406789,"d":"1 m"},"",null,{"v":53.84615384615385,"d":"53.85 "},{"v":46.15384615384615,"d":"46.154"},{"v":20.369574559518693,"d":"20.370 "},{"v":25.784271594327464,"d":"25.784 "},{"v":100,"d":"100 "}]
[1.4,{"$nulls":6},{"v":4,"d":"4 m"},null,4,{"$f":"IF($F$44=\"oxy\",\"m\",IF(L54>1.4,\"   Pa  <  à\",\"m\"))","v":"m"},{"v":0.7,"d":"0.70"},{"v":0.3089385474860335,"d":"0.31"},{"v":0.5,"d":"50.00%"},{"v":0,"d":"0 m"},{"v":1.3049924878825827,"d":"1 m"},"",null,{"v":50,"d":"50.00 "},{"v":50,"d":"50.000"},{"v":22.067039106145252,"d":"22.067 "},{"v":27.932960893854755,"d":"27.933 "},{"v":100,"d":"100 "}]
[1.5,{"$nulls":6},{"v":5,"d":"5 m"},null,5,{"$f":"IF($F$44=\"oxy\",\"m\",IF(L55>1.5,\"   Pa  <  à\",\"m\"))","v":"m"},{"v":0.7,"d":"0.70"},{"v":0.35307262569832404,"d":"0.35"},{"v":0.4666666666666666,"d":"46.67%"},{"v":0,"d":"0 m"},{"v":1.8107618166244883,"d":"2 m"},"",null,{"v":46.666666666666664,"d":"46.67 "},{"v":53.333333333333336,"d":"53.333"},{"v":23.538175046554937,"d":"23.538 "},{"v":29.795158286778403,"d":"29.795 "},{"v":100,"d":"100 "}]
[1.6,{"$nulls":6},{"v":6,"d":"6 m"},null,6,{"$f":"IF($F$44=\"oxy\",\"m\",IF(L56>1.6,\"   Pa  <  à\",\"m\"))","v":"m"},{"v":0.7,"d":"0.70"},{"v":0.39720670391061463,"d":"0.40"},{"v":0.43749999999999994,"d":"43.75%"},{"v":0,"d":"0 m"},{"v":2.316531145366394,"d":"2 m"},{"$f":"IF($Q$42<=0.16,\"hypoxie\",IF(K56=\"   Pa  <  à\",\"impossible\",IF(F44=\"oxy\",\"rinçage 02\",\"\")))","v":""},null,{"v":43.74999999999999,"d":"43.75 "},{"$f":"100-S56","v":{"v":56.25000000000001,"d":"56.250"}},{"$f":"T56/($T$47+1)","v":{"v":24.82541899441341,"d":"24.825 "}},{"v":31.42458100558659,"d":"31.425 "},{"v":100,"d":"100 "}]
[1.7,{"$f":"IF(A57*$E$20/100>$Q$43,\"PP02 rinçage ou OC > set point, taper OC en F47\",\"\")","v":""},{"$nulls":5},{"v":7,"d":"7 m"},null,{"$f":"IF($F$47=\"oc\",IF($E$20>S57,\"OC ou\",(A57-1)*10),(A57-1)*10)","v":7},{"$f":"IF(J57=\"OC ou\",\" rinçage  =\",\"m\")","v":"m"},{"$f":"IF($F$47=\"oc\",IF(A57*$E$20/100>$Q$43,A57*$E$20/100,$Q$43),$Q$43)","v":{"v":0.7,"d":"0.70"}},{"$f":"IF($R$47=0,0,IF(K57=\"m\",U57*A57/100,$R$47*A57/100))","v":{"v":0.44134078212290506,"d":"0.44"}},{"$f":"IF(K57=\"m\",S57/100,L57/A57)","v":{"v":0.4117647058823529,"d":"41.18%"}},{"$f":"IF(M57<0,\"!\",IF(M57<0.79,0,(10*M57)/0.79-7.9/0.79))","v":{"v":0,"d":"0 m"}},{"v":2.8223004741082995,"d":"3 m"},{"$f":"IF(O57>(A57*10)-10,\"Pne>P\",IF(L57>1.6,\"hyperoxie\",\"\"))","v":""},{"$f":"IF(M57>5.53,\"Narcose\",IF(M57>3.56,\"Pne>à35m\",\"\"))","v":""},{"$f":"$Q$43/A57*100","v":{"v":41.17647058823529,"d":"41.18 "}},{"$f":"100-S57","v":{"v":58.82352941176471,"d":"58.824"}},{"$f":"T57/($T$47+1)","v":{"v":25.961222477817945,"d":"25.961 "}},{"v":32.86230693394677,"d":"32.862 "},{"v":100,"d":"100 "}]
[1.8,{"$f":"IF(A58*$E$20/100>$Q$43,\"PP02 rinçage ou OC > set point, taper OC en F47\",\"\")","v":""},{"$nulls":5},{"v":8,"d":"8 m"},null,8,{"$f":"IF(J58=\"OC ou\",\" rinçage  =\",\"m\")","v":"m"},{"v":0.7,"d":"0.70"},{"$f":"IF($R$47=0,0,IF(K58=\"m\",U58*A58/100,$R$47*A58/100))","v":{"v":0.48547486033519555,"d":"0.49"}},{"$f":"IF(K58=\"m\",S58/100,L58/A58)","v":{"v":0.38888888888888884,"d":"38.89%"}},{"$f":"IF(M58<0,\"!\",IF(M58<0.79,0,(10*M58)/0.79-7.9/0.79))","v":{"v":0,"d":"0 m"}},{"v":3.328069802850205,"d":"3 m"},{"$f":"IF(O58>(A58*10)-10,\"Pne>P\",IF(L58>1.6,\"hyperoxie\",\"\"))","v":""},{"$f":"IF(M58>5.53,\"Narcose\",IF(M58>3.56,\"Pne>à35m\",\"\"))","v":""},{"$f":"$Q$43/A58*100","v":{"v":38.888888888888886,"d":"38.89 "}},{"v":61.111111111111114,"d":"61.111"},{"v":26.97082557417753,"d":"26.971 "},{"v":34.14028553693359,"d":"34.140 "},{"v":100,"d":"100 "}]
[1.9,"",{"$nulls":5},{"v":9,"d":"9 m"},null,9,"m",{"v":0.7,"d":"0.70"},{"v":0.529608938547486,"d":"0.53"},{"v":0.3684210526315789,"d":"36.84%"},{"$f":"IF(M59<0,\"!\",IF(M59<0.79,0,(10*M59)/0.79-7.9/0.79))","v":{"v":0,"d":"0 m"}},{"v":3.833839131592109,"d":"4 m"},"","",{"v":36.84210526315789,"d":"36.84 "},{"v":63.15789473684211,"d":"63.158"},{"v":27.874154660394,"d":"27.874 "},{"v":35.28374007644811,"d":"35.284 "},{"v":100,"d":"100 "}]
[2,"",{"$nulls":5},{"v":10,"d":"10 m"},null,10,"m",{"v":0.7,"d":"0.70"},{"v":0.5737430167597765,"d":"0.57"},{"v":0.35,"d":"35.00%"},{"$f":"IF(M60<0,\"!\",IF(M60<0.79,0,(10*M60)/0.79-7.9/0.79))","v":{"v":0,"d":"0 m"}},{"v":4.339608460334015,"d":"4 m"},"","",{"v":35,"d":"35.00 "},{"v":65,"d":"65.000"},{"v":28.687150837988824,"d":"28.687 "},{"v":36.312849162011176,"d":"36.313 "},{"v":100,"d":"100 "}]
[2.1,"",{"$nulls":5},{"v":11,"d":"11 m"},null,11,"m",{"v":0.7,"d":"0.70"},{"v":0.6178770949720671,"d":"0.62"},{"v":0.33333333333333326,"d":"33.33%"},{"$f":"IF(M61=\"\",\"\",IF(M61<0,\"!\",IF(M61<0.79,0,(10*M61)/0.79-7.9/0.79)))","v":{"v":0,"d":"0 m"}},{"v":4.84537778907592,"d":"5 m"},"","",{"v":33.33333333333333,"d":"33.33 "},{"v":66.66666666666667,"d":"66.667"},{"v":29.422718808193668,"d":"29.423 "},{"v":37.24394785847301,"d":"37.244 "},{"v":100,"d":"100 "}]
[2.2,"",{"$nulls":5},{"v":12,"d":"12 m"},null,12.000000000000002,"m",{"v":0.7,"d":"0.70"},{"v":0.6620111731843576,"d":"0.66"},{"v":0.3181818181818181,"d":"31.82%"},{"$f":"IF(M62=\"\",\"\",IF(M62<0,\"!\",IF(M62<0.79,0,(10*M62)/0.79-7.9/0.79)))","v":{"v":0,"d":"0 m"}},{"v":5.351147117817824,"d":"5 m"},"","",{"v":31.818181818181813,"d":"31.82 "},{"v":68.18181818181819,"d":"68.182"},{"v":30.091416962925344,"d":"30.091 "},{"v":38.09040121889284,"d":"38.090 "},{"v":100,"d":"100 "}]
[2.3,"",{"$nulls":5},{"v":13,"d":"13 m"},null,12.999999999999998,"m",{"v":0.7,"d":"0.70"},{"v":0.706145251396648,"d":"0.71"},{"v":0.30434782608695654,"d":"30.43%"},{"v":0,"d":"0 m"},{"v":5.85691644655973,"d":"6 m"},"","",{"v":30.434782608695656,"d":"30.43 "},{"v":69.56521739130434,"d":"69.565"},{"v":30.701967452028175,"d":"30.702 "},{"v":38.86324993927617,"d":"38.863 "},{"v":100,"d":"100 "}]
[2.4,"",{"$nulls":5},{"v":14,"d":"14 m"},null,14,"m",{"v":0.7,"d":"0.70"},{"v":0.7502793296089385,"d":"0.75"},{"v":0.2916666666666667,"d":"29.17%"},{"v":0,"d":"0 m"},{"v":6.362685775301632,"d":"6 m"},"","",{"v":29.166666666666668,"d":"29.17 "},{"v":70.83333333333333,"d":"70.833"},{"v":31.26163873370577,"d":"31.262 "},{"v":39.57169459962756,"d":"39.572 "},{"v":100,"d":"100 "}]
[2.5,"",{"$nulls":5},{"v":15,"d":"15 m"},null,15,"m",{"v":0.7,"d":"0.70"},{"v":0.7944134078212289,"d":"0.79"},{"v":0.27999999999999997,"d":"28.00%"},{"v":0.05586592178770644,"d":"0 m"},{"v":6.868455104043541,"d":"7 m"},"","",{"v":27.999999999999996,"d":"28.00 "},{"v":72,"d":"72.000"},{"v":31.77653631284916,"d":"31.777 "},{"v":40.22346368715084,"d":"40.223 "},{"v":100,"d":"100 "}]
[2.6,"",{"$nulls":5},{"v":16,"d":"16 m"},null,16,"m",{"v":0.7,"d":"0.70"},{"v":0.8385474860335197,"d":"0.84"},{"v":0.2692307692307692,"d":"26.92%"},{"v":0.6145251396648064,"d":"1 m"},{"v":7.3742244327854465,"d":"7 m"},"","",{"v":26.923076923076923,"d":"26.92 "},{"v":73.07692307692308,"d":"73.077"},{"v":32.2518263859046,"d":"32.252 "},{"v":40.82509669101847,"d":"40.825 "},{"v":99.99999999999999,"d":"100 "}]
[2.7,"",{"$nulls":5},{"v":17,"d":"17 m"},null,17,"m",{"v":0.7,"d":"0.70"},{"v":0.8826815642458101,"d":"0.88"},{"v":0.25925925925925924,"d":"25.93%"},{"v":1.1731843575418992,"d":"1 m"},{"v":7.879993761527352,"d":"8 m"},"","",{"v":25.925925925925924,"d":"25.93 "},{"v":74.07407407407408,"d":"74.074"},{"v":32.69190978688185,"d":"32.692 "},{"v":41.382164287192225,"d":"41.382 "},{"v":100,"d":"100 "}]
[2.8,"",{"$nulls":5},{"v":18,"d":"18 m"},null,18,"m",{"v":0.7,"d":"0.70"},{"v":0.9268156424581003,"d":"0.93"},{"v":0.25,"d":"25.00%"},{"v":1.7318435754189903,"d":"2 m"},{"v":8.385763090269258,"d":"8 m"},"","",{"v":25,"d":"25.00 "},{"v":75,"d":"75.000"},{"v":33.100558659217874,"d":"33.101 "},{"v":41.899441340782126,"d":"41.899 "},{"v":100,"d":"100 "}]
[2.9,"",{"$nulls":5},{"v":19,"d":"19 m"},null,19,"m",{"v":0.7,"d":"0.70"},{"v":0.970949720670391,"d":"0.97"},{"v":0.24137931034482757,"d":"24.14%"},{"v":2.2905027932960884,"d":"2 m"},{"v":8.89153241901116,"d":"9 m"},"","",{"v":24.137931034482758,"d":"24.14 "},{"v":75.86206896551724,"d":"75.862"},{"v":33.481024850703136,"d":"33.481 "},{"v":42.3810441148141,"d":"42.381 "},{"v":100,"d":"100 "}]
[3,"",{"$nulls":5},{"v":20,"d":"20 m"},null,20,"m",{"v":0.7,"d":"0.70"},{"v":1.0150837988826817,"d":"1.02"},{"v":0.2333333333333333,"d":"23.33%"},{"v":2.849162011173185,"d":"3 m"},{"v":9.397301747753069,"d":"9 m"},"","",{"v":23.333333333333332,"d":"23.33 "},{"v":76.66666666666667,"d":"76.667"},{"v":33.83612662942272,"d":"33.836 "},{"v":42.83054003724395,"d":"42.831 "},{"v":100,"d":"100 "}]
[3.1,"",{"$nulls":5},{"v":21,"d":"21 m"},null,21,"m",{"v":0.7,"d":"0.70"},{"v":1.059217877094972,"d":"1.06"},{"v":0.2258064516129032,"d":"22.58%"},{"v":3.4078212290502794,"d":"3 m"},{"v":9.903071076494975,"d":"10 m"},"","",{"v":22.58064516129032,"d":"22.58 "},{"v":77.41935483870968,"d":"77.419"},{"v":34.16831861596684,"d":"34.168 "},{"v":43.25103622274284,"d":"43.251 "},{"v":100,"d":"100 "}]
[3.2,"",{"$nulls":5},{"v":22,"d":"22 m"},null,22,"m",{"v":0.7,"d":"0.70"},{"v":1.1033519553072626,"d":"1.10"},{"v":0.21874999999999997,"d":"21.88%"},{"v":3.966480446927374,"d":"4 m"},{"v":10.40884040523688,"d":"10 m"},"","",{"v":21.874999999999996,"d":"21.88 "},78.125,{"v":34.47974860335196,"d":"34.480 "},{"v":43.64525139664805,"d":"43.645 "},{"v":100,"d":"100 "}]
[3.3,"",{"$nulls":5},{"v":23,"d":"23 m"},null,23,"m",{"v":0.7,"d":"0.70"},{"v":1.147486033519553,"d":"1.15"},{"v":0.2121212121212121,"d":"21.21%"},{"v":4.525139664804467,"d":"5 m"},{"v":10.914609733978786,"d":"11 m"},"","",{"v":21.21212121212121,"d":"21.21 "},{"v":78.78787878787878,"d":"78.788"},{"v":34.77230404604706,"d":"34.772 "},{"v":44.01557474183173,"d":"44.016 "},{"v":100,"d":"100 "}]
[3.4,"",{"$nulls":5},{"v":24,"d":"24 m"},null,24,"m",{"v":0.7,"d":"0.70"},{"v":1.1916201117318435,"d":"1.19"},{"v":0.20588235294117646,"d":"20.59%"},{"v":5.083798882681563,"d":"5 m"},{"v":11.420379062720691,"d":"11 m"},"","",{"v":20.588235294117645,"d":"20.59 "},{"v":79.41176470588235,"d":"79.412"},{"v":35.04765034505422,"d":"35.048 "},{"v":44.36411436082813,"d":"44.364 "},{"v":100,"d":"100 "}]
[3.5,"",{"$nulls":5},{"v":25,"d":"25 m"},null,25,"m",{"v":0.7,"d":"0.70"},{"v":1.2357541899441342,"d":"1.24"},{"v":0.2,"d":"20.00%"},{"v":5.64245810055866,"d":"6 m"},{"v":11.926148391462597,"d":"12 m"},"","",{"v":20,"d":"20.00 "},{"v":80,"d":"80.000"},{"v":35.3072625698324,"d":"35.307 "},{"v":44.6927374301676,"d":"44.693 "},{"v":100,"d":"100 "}]
[3.6,"",{"$nulls":5},{"v":26,"d":"26 m"},null,26,"m",{"v":0.7,"d":"0.70"},{"v":1.2798882681564245,"d":"1.28"},{"v":0.19444444444444442,"d":"19.44%"},{"v":6.201117318435752,"d":"6 m"},{"v":12.431917720204503,"d":"12 m"},"","",{"v":19.444444444444443,"d":"19.44 "},{"v":80.55555555555556,"d":"80.556"},{"v":35.552451893234014,"d":"35.552 "},{"v":45.00310366232154,"d":"45.003 "},{"v":100,"d":"100 "}]
[3.7,"",{"$nulls":5},{"v":27,"d":"27 m"},null,27,"m",{"v":0.7,"d":"0.70"},{"v":1.324022346368715,"d":"1.32"},{"v":0.18918918918918914,"d":"18.92%"},{"v":6.759776536312849,"d":"7 m"},{"v":12.937687048946408,"d":"13 m"},"","",{"v":18.918918918918916,"d":"18.92 "},{"v":81.08108108108108,"d":"81.081"},{"v":35.784387739695,"d":"35.784 "},{"v":45.29669334138609,"d":"45.297 "},{"v":100.00000000000001,"d":"100 "}]
[3.8,"",{"$nulls":5},{"v":28,"d":"28 m"},null,28,"m",{"v":0.7,"d":"0.70"},{"v":1.3681564245810054,"d":"1.37"},{"v":0.18421052631578946,"d":"18.42%"},{"v":7.318435754189942,"d":"7 m"},{"v":13.443456377688307,"d":"13 m"},"","",{"v":18.421052631578945,"d":"18.42 "},{"v":81.57894736842105,"d":"81.579"},{"v":36.00411643634225,"d":"36.004 "},{"v":45.574830932078804,"d":"45.575 "},{"v":100,"d":"100 "}]
[3.9,"",{"$nulls":5},{"v":29,"d":"29 m"},null,29,"m",{"v":0.7,"d":"0.70"},{"v":1.412290502793296,"d":"1.41"},{"v":0.1794871794871795,"d":"17.95%"},{"v":7.8770949720670345,"d":"8 m"},{"v":13.949225706430216,"d":"14 m"},"","",{"v":17.94871794871795,"d":"17.95 "},{"v":82.05128205128204,"d":"82.051"},{"v":36.212576994699894,"d":"36.213 "},{"v":45.83870505658216,"d":"45.839 "},{"v":100,"d":"100 "}]
[4,"",{"$nulls":5},{"v":30,"d":"30 m"},null,30,"m",{"v":0.7,"d":"0.70"},{"v":1.4564245810055865,"d":"1.46"},{"v":0.175,"d":"17.50%"},{"v":8.435754189944134,"d":"8 m"},{"v":14.454995035172121,"d":"14 m"},"","",{"v":17.5,"d":"17.50 "},{"v":82.5,"d":"82.500"},{"v":36.410614525139664,"d":"36.411 "},{"v":46.089385474860336,"d":"46.089 "},{"v":100,"d":"100 "}]
[4.1,"",{"$nulls":5},{"v":31,"d":"31 m"},null,30.999999999999996,"m",{"v":0.7,"d":"0.70"},{"v":1.5005586592178768,"d":"1.50"},{"v":0.17073170731707318,"d":"17.07%"},{"v":8.994413407821224,"d":"9 m"},{"v":14.960764363914024,"d":"15 m"},"","",{"v":17.073170731707318,"d":"17.07 "},{"v":82.92682926829268,"d":"82.927"},{"v":36.5989916882409,"d":"36.599 "},{"v":46.32783758005178,"d":"46.328 "},{"v":100,"d":"100 "}]
[4.2,"",{"$nulls":5},{"v":32,"d":"32 m"},null,32,"m",{"v":0.7,"d":"0.70"},{"v":1.544692737430168,"d":"1.54"},{"v":0.16666666666666663,"d":"16.67%"},{"v":9.553072625698327,"d":"10 m"},{"v":15.466533692655936,"d":"15 m"},"","",{"v":16.666666666666664,"d":"16.67 "},{"v":83.33333333333334,"d":"83.333"},{"v":36.77839851024209,"d":"36.778 "},{"v":46.554934823091244,"d":"46.555 "},{"v":100,"d":"100 "}]
[4.3,"",{"$nulls":5},{"v":33,"d":"33 m"},null,33,"m",{"v":0.7,"d":"0.70"},{"v":1.588826815642458,"d":"1.59"},{"v":0.16279069767441856,"d":"16.28%"},{"v":10.111731843575416,"d":"10 m"},{"v":15.972303021397835,"d":"16 m"},"","",{"v":16.279069767441857,"d":"16.28 "},{"v":83.72093023255815,"d":"83.721"},{"v":36.949460828894374,"d":"36.949 "},{"v":46.77146940366377,"d":"46.771 "},{"v":100,"d":"100 "}]
[4.4,"",{"$nulls":5},{"v":34,"d":"34 m"},null,34,"m",{"v":0.7,"d":"0.70"},{"v":1.6329608938547486,"d":"1.63"},{"v":0.15909090909090906,"d":"15.91%"},{"v":10.670391061452513,"d":"11 m"},{"v":16.478072350139744,"d":"16 m"},"","",{"v":15.909090909090907,"d":"15.91 "},{"v":84.0909090909091,"d":"84.091"},{"v":37.11274758760792,"d":"37.113 "},{"v":46.97816150330117,"d":"46.978 "},{"v":100,"d":"100 "}]
[4.5,"",{"$nulls":5},{"v":35,"d":"35 m"},null,35,"m",{"v":0.7,"d":"0.70"},{"v":1.677094972067039,"d":"1.68"},{"v":0.15555555555555556,"d":"15.56%"},{"v":11.22905027932961,"d":"11 m"},{"v":16.983841678881646,"d":"17 m"},"","",{"v":15.555555555555555,"d":"15.56 "},{"v":84.44444444444444,"d":"84.444"},{"v":37.268777157045314,"d":"37.269 "},{"v":47.17566728739913,"d":"47.176 "},{"v":100,"d":"100 "}]
[4.6,"",{"$nulls":5},{"v":36,"d":"36 m"},null,36,"m",{"v":0.7,"d":"0.70"},{"v":1.7212290502793295,"d":"1.72"},{"v":0.15217391304347827,"d":"15.22%"},{"v":11.787709497206702,"d":"12 m"},{"v":17.48961100762355,"d":"17 m"},"","",{"v":15.217391304347828,"d":"15.22 "},{"v":84.78260869565217,"d":"84.783"},{"v":37.41802283215934,"d":"37.418 "},{"v":47.364585863492835,"d":"47.365 "},{"v":100,"d":"100 "}]
[4.7,"",{"$nulls":5},{"v":37,"d":"37 m"},null,37,"m",{"v":0.7,"d":"0.70"},{"v":1.7653631284916198,"d":"1.77"},{"v":0.14893617021276595,"d":"14.89%"},{"v":12.346368715083795,"d":"12 m"},{"v":17.99538033636546,"d":"18 m"},"","",{"v":14.893617021276595,"d":"14.89 "},{"v":85.1063829787234,"d":"85.106"},{"v":37.560917627481274,"d":"37.561 "},{"v":47.54546535124213,"d":"47.545 "},{"v":100,"d":"100 "}]
[4.8,"",{"$nulls":5},{"v":38,"d":"38 m"},null,38,"m",{"v":0.7,"d":"0.70"},{"v":1.8094972067039103,"d":"1.81"},{"v":0.14583333333333334,"d":"14.58%"},{"v":12.905027932960888,"d":"13 m"},{"v":18.501149665107363,"d":"19 m"},"","",{"v":14.583333333333334,"d":"14.58 "},{"v":85.41666666666667,"d":"85.417"},{"v":37.697858472998135,"d":"37.698 "},{"v":47.71880819366853,"d":"47.719 "},{"v":99.99999999999999,"d":"100 "}]
[4.9,"",{"$nulls":5},{"v":39,"d":"39 m"},null,39,"m",{"v":0.7,"d":"0.70"},{"v":1.8536312849162013,"d":"1.85"},{"v":0.14285714285714285,"d":"14.29%"},{"v":13.463687150837988,"d":"13 m"},{"v":19.006918993849276,"d":"19 m"},"","",{"v":14.285714285714285,"d":"14.29 "},{"v":85.71428571428572,"d":"85.714"},{"v":37.829209896249004,"d":"37.829 "},{"v":47.88507581803671,"d":"47.885 "},{"v":100,"d":"100 "}]
[5,"",{"$nulls":5},{"v":40,"d":"40 m"},null,40,"m",{"v":0.7,"d":"0.70"},{"v":1.8977653631284914,"d":"1.90"},{"v":0.13999999999999999,"d":"14.00%"},{"v":14.022346368715084,"d":"14 m"},{"v":19.512688322591174,"d":"20 m"},"","",{"v":13.999999999999998,"d":"14.00 "},{"v":86,"d":"86.000"},{"v":37.95530726256983,"d":"37.955 "},{"v":48.04469273743017,"d":"48.045 "},{"v":100,"d":"100 "}]
[5.1,"",{"$nulls":5},{"v":41,"d":"41 m"},null,41,"m",{"v":0.7,"d":"0.70"},{"v":1.941899441340782,"d":"1.94"},{"v":0.13725490196078433,"d":"13.73%"},{"v":14.581005586592177,"d":"15 m"},{"v":20.01845765133308,"d":"20 m"},"","",{"v":13.725490196078432,"d":"13.73 "},{"v":86.27450980392157,"d":"86.275"},{"v":38.07645963413298,"d":"38.076 "},{"v":48.19805016978859,"d":"48.198 "},{"v":100,"d":"100 "}]
[5.2,"",{"$nulls":5},{"v":42,"d":"42 m"},null,42,"m",{"v":0.7,"d":"0.70"},{"v":1.9860335195530725,"d":"1.99"},{"v":0.1346153846153846,"d":"13.46%"},{"v":15.13966480446927,"d":"15 m"},{"v":20.524226980074985,"d":"21 m"},"","",{"v":13.461538461538462,"d":"13.46 "},{"v":86.53846153846153,"d":"86.538"},{"v":38.19295229909755,"d":"38.193 "},{"v":48.34550923936399,"d":"48.346 "},{"v":100.00000000000001,"d":"100 "}]
[5.3,"",{"$nulls":5},{"v":43,"d":"43 m"},null,43,"m",{"v":0.7,"d":"0.70"},{"v":2.030167597765363,"d":"2.03"},{"v":0.1320754716981132,"d":"13.21%"},{"v":15.698324022346366,"d":"16 m"},{"v":21.029996308816898,"d":"21 m"},"","",{"v":13.20754716981132,"d":"13.21 "},{"v":86.79245283018868,"d":"86.792"},{"v":38.30504901444081,"d":"38.305 "},{"v":48.48740381574787,"d":"48.487 "},{"v":100,"d":"100 "}]
[5.4,{"$f":"IF(A94*$E$20/100>$Q$44,\"PP02 rinçage ou OC > set point, taper OC en F47\",\"\")","v":""},{"$nulls":5},{"v":44,"d":"44 m"},null,44,{"$f":"IF(J94=\"OC ou\",\" rinçage  =\",\"m\")","v":"m"},{"$f":"IF($F$47=\"oc\",IF(A94*$E$20/100>$Q$44,A94*$E$20/100,$Q$44),$Q$44)","v":{"v":1.3,"d":"1.30"}},{"v":1.8094972067039106,"d":"1.81"},{"v":0.24074074074074073,"d":"24.07%"},{"v":12.905027932960891,"d":"13 m"},{"$f":"IF(J94=\"OC ou\",(((((($E$20%*1.428)+($F$20%*0.178)+($D$23%*1.25))*A94))/1.28738)*10)-10,((((((S94%*1.428)+(V94%*0.178)+(U94%*1.25))*A94))/1.28738)*10)-10)","v":{"v":25.15652725369815,"d":"25 m"}},{"$f":"IF(O94>(A94*10)-10,\"Pne>P\",IF(L94>1.5,\"hyperoxie\",\"\"))","v":""},"",{"$f":"$Q$44/A94*100","v":{"v":24.074074074074073,"d":"24.07 "}},{"v":75.92592592592592,"d":"75.926"},{"v":33.5092075315539,"d":"33.509 "},{"v":42.416718394372026,"d":"42.417 "},{"v":100,"d":"100 "}]
[5.5,{"$f":"IF(A95*$E$20/100>$Q$44,\"PP02 rinçage ou OC > set point, taper OC en F47\",\"\")","v":""},{"$nulls":5},{"v":45,"d":"45 m"},null,45,{"$f":"IF(J95=\"OC ou\",\" rinçage  =\",\"m\")","v":"m"},{"v":1.3,"d":"1.30"},{"v":1.8536312849162007,"d":"1.85"},{"v":0.23636363636363636,"d":"23.64%"},{"v":13.46368715083798,"d":"13 m"},{"v":25.662296582440057,"d":"26 m"},{"$f":"IF(O95>(A95*10)-10,\"Pne>P\",IF(L95>1.5,\"hyperoxie\",\"\"))","v":""},"",{"v":23.636363636363637,"d":"23.64 "},{"v":76.36363636363636,"d":"76.364"},{"v":33.70238699847638,"d":"33.702 "},{"v":42.66124936515999,"d":"42.661 "},{"v":100.00000000000001,"d":"100 "}]
[5.6,"",{"$nulls":5},{"v":46,"d":"46 m"},null,46,"m",{"v":1.3,"d":"1.30"},{"v":1.8977653631284914,"d":"1.90"},{"v":0.23214285714285718,"d":"23.21%"},{"v":14.022346368715084,"d":"14 m"},{"v":26.168065911181955,"d":"26 m"},"","",{"v":23.21428571428572,"d":"23.21 "},{"v":76.78571428571428,"d":"76.786"},{"v":33.88866719872306,"d":"33.889 "},{"v":42.89704708699122,"d":"42.897 "},{"v":100,"d":"100 "}]
[5.7,"",{"$nulls":5},{"v":47,"d":"47 m"},null,47,"m",{"v":1.3,"d":"1.30"},{"v":1.9418994413407824,"d":"1.94"},{"v":0.22807017543859648,"d":"22.81%"},{"v":14.58100558659218,"d":"15 m"},{"v":26.67383523992386,"d":"27 m"},"","",{"v":22.807017543859647,"d":"22.81 "},{"v":77.19298245614036,"d":"77.193"},{"v":34.06841125159267,"d":"34.068 "},{"v":43.12457120454768,"d":"43.125 "},{"v":100,"d":"100 "}]
[5.8,"",{"$nulls":5},{"v":48,"d":"48 m"},null,48,"m",{"v":1.3,"d":"1.30"},{"v":1.986033519553072,"d":"1.99"},{"v":0.22413793103448276,"d":"22.41%"},{"v":15.139664804469263,"d":"15 m"},{"v":27.179604568665766,"d":"27 m"},"","",{"v":22.413793103448278,"d":"22.41 "},{"v":77.58620689655172,"d":"77.586"},{"v":34.24195723367366,"d":"34.242 "},{"v":43.34424966287806,"d":"43.344 "},{"v":100,"d":"100 "}]
[5.9,"",{"$nulls":5},{"v":49,"d":"49 m"},null,49,"m",{"v":1.3,"d":"1.30"},{"v":2.0301675977653635,"d":"2.03"},{"v":0.22033898305084743,"d":"22.03%"},{"v":15.69832402234637,"d":"16 m"},{"v":27.685373897407672,"d":"28 m"},"","",{"v":22.033898305084744,"d":"22.03 "},{"v":77.96610169491525,"d":"77.966"},{"v":34.40962030110785,"d":"34.410 "},{"v":43.5564813938074,"d":"43.556 "},{"v":100,"d":"100 "}]
[6,"",{"$nulls":5},{"v":50,"d":"50 m"},null,50,"m",{"v":1.3,"d":"1.30"},{"v":2.074301675977653,"d":"2.07"},{"v":0.21666666666666667,"d":"21.67%"},{"v":16.256983240223455,"d":"16 m"},{"v":28.191143226149578,"d":"28 m"},"","",{"v":21.666666666666668,"d":"21.67 "},{"v":78.33333333333333,"d":"78.333"},{"v":34.571694599627556,"d":"34.572 "},{"v":43.76163873370578,"d":"43.762 "},{"v":100.00000000000001,"d":"100 "}]
[6.1,"",{"$nulls":5},{"v":51,"d":"51 m"},null,51,"m",{"v":1.3,"d":"1.30"},{"v":2.118435754189944,"d":"2.12"},{"v":0.21311475409836067,"d":"21.31%"},{"v":16.81564245810056,"d":"17 m"},{"v":28.696912554891483,"d":"29 m"},"","",{"v":21.311475409836067,"d":"21.31 "},{"v":78.68852459016394,"d":"78.689"},{"v":34.72845498672039,"d":"34.728 "},{"v":43.96006960344354,"d":"43.960 "},{"v":100,"d":"100 "}]
[6.2,"",{"$nulls":5},{"v":52,"d":"52 m"},null,52,"m",{"v":1.3,"d":"1.30"},{"v":2.162569832402234,"d":"2.16"},{"v":0.20967741935483872,"d":"20.97%"},{"v":17.374301675977645,"d":"17 m"},{"v":29.20268188363339,"d":"29 m"},"","",{"v":20.967741935483872,"d":"20.97 "},{"v":79.03225806451613,"d":"79.032"},{"v":34.88015858713281,"d":"34.880 "},{"v":44.15209947738332,"d":"44.152 "},{"v":100,"d":"100 "}]
[6.3,"",{"$nulls":5},{"v":53,"d":"53 m"},null,53,"m",{"v":1.3,"d":"1.30"},{"v":2.206703910614525,"d":"2.21"},{"v":0.20634920634920637,"d":"20.63%"},{"v":17.932960893854748,"d":"18 m"},{"v":29.7084512123753,"d":"30 m"},"","",{"v":20.634920634920636,"d":"20.63 "},{"v":79.36507936507937,"d":"79.365"},{"v":35.02704620023056,"d":"35.027 "},{"v":44.33803316484881,"d":"44.338 "},{"v":100,"d":"100 "}]
[6.4,"",{"$nulls":5},{"v":54,"d":"54 m"},null,54,"m",{"v":1.3,"d":"1.30"},{"v":2.2508379888268153,"d":"2.25"},{"v":0.203125,"d":"20.31%"},{"v":18.491620111731837,"d":"18 m"},{"v":30.2142205411172,"d":"30 m"},"","",{"v":20.3125,"d":"20.31 "},{"v":79.6875,"d":"79.688"},{"v":35.16934357541899,"d":"35.169 "},{"v":44.51815642458101,"d":"44.518 "},{"v":100,"d":"100 "}]
[6.50000000000001,"",{"$nulls":5},{"v":55,"d":"55 m"},null,55.0000000000001,"m",{"v":1.3,"d":"1.30"},{"v":2.2949720670391103,"d":"2.29"},{"v":0.1999999999999997,"d":"20.00%"},{"v":19.050279329608987,"d":"19 m"},{"v":30.719989869859162,"d":"31 m"},"","",{"v":19.99999999999997,"d":"20.00 "},{"v":80.00000000000003,"d":"80.000"},{"v":35.30726256983241,"d":"35.307 "},{"v":44.69273743016762,"d":"44.693 "},{"v":100,"d":"100 "}]
[6.6,"",{"$nulls":5},{"v":56,"d":"56 m"},null,56,"m",{"v":1.3,"d":"1.30"},{"v":2.3391061452513964,"d":"2.34"},{"v":0.196969696969697,"d":"19.70%"},{"v":19.608938547486026,"d":"20 m"},{"v":31.22575919860101,"d":"31 m"},"","",{"v":19.6969696969697,"d":"19.70 "},{"v":80.3030303030303,"d":"80.303"},{"v":35.44100220077873,"d":"35.441 "},{"v":44.86202810225157,"d":"44.862 "},{"v":100.00000000000001,"d":"100 "}]
[6.7,"",{"$nulls":5},{"v":57,"d":"57 m"},null,57,"m",{"v":1.3,"d":"1.30"},{"v":2.383240223463687,"d":"2.38"},{"v":0.19402985074626866,"d":"19.40%"},{"v":20.167597765363126,"d":"20 m"},{"v":31.731528527342917,"d":"32 m"},"","",{"v":19.402985074626866,"d":"19.40 "},{"v":80.59701492537313,"d":"80.597"},{"v":35.570749603935624,"d":"35.571 "},{"v":45.026265321437506,"d":"45.026 "},{"v":100,"d":"100 "}]
[6.80000000000001,"",{"$nulls":5},{"v":58,"d":"58 m"},null,58.0000000000001,"m",{"v":1.3,"d":"1.30"},{"v":2.427374301675982,"d":"2.43"},{"v":0.19117647058823503,"d":"19.12%"},{"v":20.726256983240276,"d":"21 m"},{"v":32.23729785608487,"d":"32 m"},"","",{"v":19.117647058823504,"d":"19.12 "},{"v":80.88235294117649,"d":"80.882"},{"v":35.69668090699968,"d":"35.697 "},{"v":45.18567203417682,"d":"45.186 "},{"v":100,"d":"100 "}]
[6.90000000000001,"",{"$nulls":5},{"v":59,"d":"59 m"},null,59.0000000000001,"m",{"v":1.3,"d":"1.30"},{"v":2.471508379888272,"d":"2.47"},{"v":0.188405797101449,"d":"18.84%"},{"v":21.284916201117365,"d":"21 m"},{"v":32.74306718482678,"d":"33 m"},"","",{"v":18.8405797101449,"d":"18.84 "},{"v":81.15942028985509,"d":"81.159"},{"v":35.81896202736621,"d":"35.819 "},{"v":45.34045826248889,"d":"45.340 "},{"v":100,"d":"100 "}]
[7.00000000000001,"",{"$nulls":5},{"v":60,"d":"60 m"},null,60.0000000000001,"m",{"v":1.3,"d":"1.30"},{"v":2.5156424581005625,"d":"2.52"},{"v":0.18571428571428547,"d":"18.57%"},{"v":21.843575418994458,"d":"22 m"},{"v":33.248836513568676,"d":"33 m"},"","",{"v":18.571428571428548,"d":"18.57 "},{"v":81.42857142857144,"d":"81.429"},{"v":35.937749401436555,"d":"35.938 "},{"v":45.4908220271349,"d":"45.491 "},{"v":100,"d":"100 "}]
[7.1,"",{"$nulls":5},{"v":61,"d":"61 m"},null,61,"m",{"v":1.3,"d":"1.30"},{"v":2.5597765363128486,"d":"2.56"},{"v":0.1830985915492958,"d":"18.31%"},{"v":22.402234636871505,"d":"22 m"},{"v":33.75460584231053,"d":"34 m"},"","",{"v":18.30985915492958,"d":"18.31 "},{"v":81.69014084507042,"d":"81.690"},{"v":36.053190652293644,"d":"36.053 "},{"v":45.63695019277678,"d":"45.637 "},{"v":100.00000000000001,"d":"100 "}]
[7.20000000000001,"",{"$nulls":5},{"v":62,"d":"62 m"},null,62.0000000000001,"m",{"v":1.3,"d":"1.30"},{"v":2.603910614525144,"d":"2.60"},{"v":0.18055555555555527,"d":"18.06%"},{"v":22.96089385474866,"d":"23 m"},{"v":34.260375171052495,"d":"34 m"},"","",{"v":18.05555555555553,"d":"18.06 "},{"v":81.94444444444447,"d":"81.944"},{"v":36.16542520173806,"d":"36.165 "},{"v":45.77901924270641,"d":"45.779 "},{"v":100,"d":"100 "}]
[7.30000000000001,"",{"$nulls":5},{"v":63,"d":"63 m"},null,63.0000000000001,"m",{"v":1.3,"d":"1.30"},{"v":2.648044692737434,"d":"2.65"},{"v":0.17808219178082169,"d":"17.81%"},{"v":23.519553072625747,"d":"24 m"},{"v":34.76614449979439,"d":"35 m"},"","",{"v":17.80821917808217,"d":"17.81 "},{"v":82.19178082191783,"d":"82.192"},{"v":36.2745848320196,"d":"36.275 "},{"v":45.91719598989823,"d":"45.917 "},{"v":100,"d":"100 "}]
[7.40000000000001,"",{"$nulls":5},{"v":64,"d":"64 m"},null,64.0000000000001,"m",{"v":1.3,"d":"1.30"},{"v":2.692178770949725,"d":"2.69"},{"v":0.17567567567567544,"d":"17.57%"},{"v":24.078212290502847,"d":"24 m"},{"v":35.2719138285363,"d":"35 m"},"","",{"v":17.567567567567544,"d":"17.57 "},{"v":82.43243243243245,"d":"82.432"},{"v":36.38079420202326,"d":"36.381 "},{"v":46.051638230409196,"d":"46.052 "},{"v":100,"d":"100 "}]
[7.50000000000001,"",{"$nulls":5},{"v":65,"d":"65 m"},null,65.0000000000001,"m",{"v":1.3,"d":"1.30"},{"v":2.7363128491620152,"d":"2.74"},{"v":0.17333333333333312,"d":"17.33%"},{"v":24.63687150837994,"d":"25 m"},{"v":35.77768315727822,"d":"36 m"},"","",{"v":17.33333333333331,"d":"17.33 "},{"v":82.66666666666669,"d":"82.667"},{"v":36.48417132216016,"d":"36.484 "},{"$f":"100-(S115+U115)","v":{"v":46.182495344506535,"d":"46.182 "}},{"$f":"V115+U115+S115","v":{"v":100,"d":"100 "}}]
[7.60000000000001,"",{"$nulls":5},{"v":66,"d":"66 m"},null,66.0000000000001,"m",{"v":1.3,"d":"1.30"},{"v":2.7804469273743058,"d":"2.78"},{"v":0.17105263157894715,"d":"17.11%"},{"v":25.195530726257033,"d":"25 m"},{"$f":"IF(J116=\"OC ou\",(((((($E$20%*1.428)+($F$20%*0.178)+($D$23%*1.25))*A116))/1.28738)*10)-10,((((((S116%*1.428)+(V116%*0.178)+(U116%*1.25))*A116))/1.28738)*10)-10)","v":{"v":36.28345248602011,"d":"36 m"}},"","",{"v":17.105263157894715,"d":"17.11 "},{"v":82.89473684210529,"d":"82.895"},{"v":36.584827991767135,"d":"36.585 "},{"v":46.30990885033815,"d":"46.310 "},{"v":100,"d":"100 "}]
[7.70000000000001,"",{"$nulls":5},{"v":67,"d":"67 m"},null,67.0000000000001,"m",{"v":1.3,"d":"1.30"},{"v":2.8245810055865967,"d":"2.82"},{"v":0.16883116883116864,"d":"16.88%"},{"v":25.754189944134133,"d":"26 m"},{"v":36.78922181476203,"d":"37 m"},"","",{"v":16.883116883116863,"d":"16.88 "},{"v":83.11688311688314,"d":"83.117"},{"v":36.68287020242329,"d":"36.683 "},{"v":46.43401291445985,"d":"46.434 "},{"v":100,"d":"100 "}]
[7.80000000000001,"",{"$nulls":5},{"v":68,"d":"68 m"},null,68.0000000000001,"m",{"v":1.3,"d":"1.30"},{"v":2.868715083798887,"d":"2.87"},{"v":0.16666666666666646,"d":"16.67%"},{"v":26.31284916201122,"d":"26 m"},{"v":37.29499114350393,"d":"37 m"},"","",{"v":16.666666666666647,"d":"16.67 "},{"v":83.33333333333336,"d":"83.333"},{"v":36.77839851024209,"d":"36.778 "},{"v":46.55493482309126,"d":"46.555 "},{"v":99.99999999999999,"d":"100 "}]
[7.90000000000001,"",{"$nulls":5},{"v":69,"d":"69 m"},null,69.0000000000001,"m",{"v":1.3,"d":"1.30"},{"v":2.912849162011178,"d":"2.91"},{"v":0.16455696202531628,"d":"16.46%"},{"v":26.871508379888326,"d":"27 m"},{"v":37.800760472245834,"d":"38 m"},"","",{"v":16.455696202531627,"d":"16.46 "},{"v":83.54430379746837,"d":"83.544"},{"v":36.871508379888276,"d":"36.872 "},{"v":46.6727954175801,"d":"46.673 "},{"v":100,"d":"100 "}]
[8.00000000000001,"",{"$nulls":5},{"v":70,"d":"70 m"},null,70.00000000000011,"m",{"v":1.3,"d":"1.30"},{"v":2.956983240223469,"d":"2.96"},{"v":0.16249999999999978,"d":"16.25%"},{"v":27.430167597765426,"d":"27 m"},{"v":38.30652980098775,"d":"38 m"},"","",{"v":16.24999999999998,"d":"16.25 "},{"v":83.75000000000003,"d":"83.750"},{"v":36.96229050279331,"d":"36.962 "},{"v":46.78770949720671,"d":"46.788 "},{"v":100,"d":"100 "}]
[8.10000000000001,"",{"$nulls":5},{"v":71,"d":"71 m"},null,{"$f":"IF($F$47=\"oc\",IF($E$20>S121,\"OC ou\",(A121-1)*10),(A121-1)*10)","v":71.0000000000001},"m",{"v":1.3,"d":"1.30"},{"v":3.0011173184357585,"d":"3.00"},{"v":0.16049382716049362,"d":"16.05%"},{"v":27.98882681564251,"d":"28 m"},{"v":38.81229912972964,"d":"39 m"},"","",{"v":16.04938271604936,"d":"16.05 "},{"$f":"100-S121","v":{"v":83.95061728395063,"d":"83.951"}},{"$f":"T121/($T$47+1)","v":{"v":37.05083109179944,"d":"37.051 "}},{"v":46.8997861921512,"d":"46.900 "},{"v":100,"d":"100 "}]
[8.20000000000001,"",{"$nulls":5},{"v":72,"d":"72 m"},null,72.0000000000001,"m",{"v":1.3,"d":"1.30"},{"$f":"IF($R$47=0,0,IF(K122=\"m\",U122*A122/100,$R$47*A122/100))","v":{"v":3.0452513966480494,"d":"3.05"}},{"$f":"IF(K122=\"m\",S122/100,L122/A122)","v":{"v":0.15853658536585347,"d":"15.85%"}},{"v":28.54748603351961,"d":"29 m"},{"v":39.31806845847155,"d":"39 m"},"",{"$f":"IF(M122>5.53,\"Narcose\",IF(M122>3.56,\"Pne>à35m\",\"\"))","v":""},{"v":15.853658536585346,"d":"15.85 "},{"v":84.14634146341466,"d":"84.146"},{"v":37.13721215424446,"d":"37.137 "},{"v":47.00912930917019,"d":"47.009 "},{"v":99.99999999999999,"d":"100 "}]
[8.30000000000001,"",{"$nulls":5},{"v":73,"d":"73 m"},null,73.0000000000001,"m",{"v":1.3,"d":"1.30"},{"v":3.0893854748603395,"d":"3.09"},{"v":0.15662650602409622,"d":"15.66%"},{"v":29.106145251396704,"d":"29 m"},{"v":39.823837787213456,"d":"40 m"},"","",{"v":15.662650602409622,"d":"15.66 "},{"v":84.33734939759037,"d":"84.337"},{"v":37.22151174530525,"d":"37.222 "},{"v":47.11583765228513,"d":"47.116 "},{"v":100,"d":"100 "}]
[8.40000000000001,"",{"$nulls":5},{"v":74,"d":"74 m"},null,74.00000000000009,"m",{"v":1.3,"d":"1.30"},{"v":3.1335195530726296,"d":"3.13"},{"v":0.1547619047619046,"d":"15.48%"},{"v":29.66480446927379,"d":"30 m"},{"v":40.329607115955355,"d":"40 m"},"","",{"v":15.47619047619046,"d":"15.48 "},{"v":84.52380952380955,"d":"84.524"},{"v":37.303804203245555,"d":"37.304 "},{"v":47.220005320563985,"d":"47.220 "},{"v":100,"d":"100 "}]
[8.50000000000001,"",{"$nulls":5},{"v":75,"d":"75 m"},null,75.00000000000011,"m",{"v":1.3,"d":"1.30"},{"v":3.17765363128492,"d":"3.18"},{"v":0.15294117647058805,"d":"15.29%"},{"v":30.22346368715089,"d":"30 m"},{"v":40.835376444697275,"d":"41 m"},"","",{"v":15.294117647058805,"d":"15.29 "},{"v":84.70588235294119,"d":"84.706"},{"v":37.38416036805784,"d":"37.384 "},{"v":47.321721984883354,"d":"47.322 "},{"v":100,"d":"100 "}]
[8.60000000000001,"",{"$nulls":5},{"v":76,"d":"76 m"},null,76.0000000000001,"m",{"$f":"IF($F$47=\"oc\",IF(A126*$E$20/100>$Q$44,A126*$E$20/100,$Q$44),$Q$44)","v":{"v":1.3,"d":"1.30"}},{"v":3.2217877094972107,"d":"3.22"},{"v":0.15116279069767424,"d":"15.12%"},{"$f":"IF(M126=\"\",\"\",IF(M126<0,\"!\",IF(M126<0.79,0,(10*M126)/0.79-7.9/0.79)))","v":{"v":30.782122905027983,"d":"31 m"}},{"v":41.34114577343918,"d":"41 m"},"","",{"v":15.116279069767424,"d":"15.12 "},{"v":84.88372093023257,"d":"84.884"},{"v":37.46264778485124,"d":"37.463 "},{"v":47.421073145381335,"d":"47.421 "},{"v":100.00000000000001,"d":"100 "}]
[8.70000000000001,"",{"$nulls":5},{"v":77,"d":"77 m"},null,77.0000000000001,"m",{"v":1.3,"d":"1.30"},{"v":3.2659217877095013,"d":"3.27"},{"v":0.14942528735632168,"d":"14.94%"},{"v":31.340782122905075,"d":"31 m"},{"v":41.84691510218108,"d":"42 m"},"","",{"v":14.942528735632168,"d":"14.94 "},{"v":85.05747126436783,"d":"85.057"},{"v":37.539330893212615,"d":"37.539 "},{"v":47.51814037115522,"d":"47.518 "},{"v":100,"d":"100 "}]
[8.80000000000001,"",{"$nulls":5},{"v":78,"d":"78 m"},null,78.0000000000001,"m",{"v":1.3,"d":"1.30"},{"v":3.3100558659217922,"d":"3.31"},{"v":0.14772727272727257,"d":"14.77%"},{"v":31.899441340782182,"d":"32 m"},{"v":42.352684430922984,"d":"42 m"},"","",{"v":14.772727272727257,"d":"14.77 "},{"v":85.22727272727275,"d":"85.227"},{"v":37.614271203656685,"d":"37.614 "},{"v":47.613001523616056,"d":"47.613 "},{"v":100,"d":"100 "}]
[8.90000000000001,"",{"$nulls":5},{"v":79,"d":"79 m"},null,79.00000000000009,"m",{"v":1.3,"d":"1.30"},{"v":3.354189944134083,"d":"3.35"},{"v":0.14606741573033694,"d":"14.61%"},{"v":32.458100558659275,"d":"32 m"},{"v":42.85845375966488,"d":"43 m"},"","",{"v":14.606741573033693,"d":"14.61 "},{"v":85.39325842696631,"d":"85.393"},{"v":37.68752746218066,"d":"37.688 "},{"v":47.705730964785644,"d":"47.706 "},{"v":99.99999999999999,"d":"100 "}]
[9.00000000000001,"",{"$nulls":5},{"v":80,"d":"80 m"},null,80.00000000000011,"m",{"v":1.3,"d":"1.30"},{"v":3.3983240223463738,"d":"3.40"},{"v":0.1444444444444443,"d":"14.44%"},{"v":33.016759776536375,"d":"33 m"},{"v":43.3642230884068,"d":"43 m"},"","",{"v":14.444444444444429,"d":"14.44 "},{"v":85.55555555555557,"d":"85.556"},{"v":37.75915580384855,"d":"37.759 "},{"v":47.79639975170702,"d":"47.796 "},{"v":100,"d":"100 "}]
[9.10000000000001,"",{"$nulls":5},{"v":81,"d":"81 m"},null,81.0000000000001,"m",{"v":1.3,"d":"1.30"},{"v":3.4424581005586634,"d":"3.44"},{"v":0.1428571428571427,"d":"14.29%"},{"v":33.575418994413454,"d":"34 m"},{"v":43.869992417148694,"d":"44 m"},"","",{"v":14.28571428571427,"d":"14.29 "},{"v":85.71428571428572,"d":"85.714"},{"v":37.829209896249004,"d":"37.829 "},{"v":47.885075818036725,"d":"47.885 "},{"v":100,"d":"100 "}]
[9.20000000000001,"",{"$nulls":5},{"v":82,"d":"82 m"},null,82.0000000000001,"m",{"v":1.3,"d":"1.30"},{"v":3.486592178770954,"d":"3.49"},{"v":0.1413043478260868,"d":"14.13%"},{"v":34.134078212290554,"d":"34 m"},{"v":44.3757617458906,"d":"44 m"},"","",{"v":14.130434782608681,"d":"14.13 "},{"v":85.86956521739131,"d":"85.870"},{"v":37.89774107359728,"d":"37.898 "},{"v":47.97182414379404,"d":"47.972 "},{"v":100,"d":"100 "}]
[9.30000000000001,"",{"$nulls":5},{"v":83,"d":"83 m"},null,83.0000000000001,"m",{"v":1.3,"d":"1.30"},{"v":3.5307262569832436,"d":"3.53"},{"v":0.139784946236559,"d":"13.98%"},{"v":34.69273743016764,"d":"35 m"},{"v":44.88153107463249,"d":"45 m"},"","",{"v":13.978494623655898,"d":"13.98 "},{"v":86.0215053763441,"d":"86.022"},{"v":37.96479846218538,"d":"37.965 "},{"v":48.056706914158724,"d":"48.057 "},{"v":100,"d":"100 "}]
[9.40000000000001,"",{"$nulls":5},{"v":84,"d":"84 m"},null,84.00000000000009,"m",{"v":1.3,"d":"1.30"},{"v":3.5748603351955346,"d":"3.57"},{"v":0.1382978723404254,"d":"13.83%"},{"v":35.25139664804474,"d":"35 m"},{"v":45.38730040337441,"d":"45 m"},"","Pne>à35m",{"v":13.82978723404254,"d":"13.83 "},{"v":86.17021276595746,"d":"86.170"},{"v":38.0304290978248,"d":"38.030 "},{"v":48.13978366813266,"d":"48.140 "},{"v":100,"d":"100 "}]
[9.50000000000001,"",{"$nulls":5},{"v":85,"d":"85 m"},null,85.00000000000011,"m",{"v":1.3,"d":"1.30"},{"v":3.618994413407825,"d":"3.62"},{"v":0.13684210526315774,"d":"13.68%"},{"v":35.81005586592184,"d":"36 m"},{"v":45.89306973211632,"d":"46 m"},"","Pne>à35m",{"v":13.684210526315773,"d":"13.68 "},{"v":86.31578947368422,"d":"86.316"},{"v":38.0946780358718,"d":"38.095 "},{"v":48.221111437812425,"d":"48.221 "},{"v":100,"d":"100 "}]
[9.60000000000001,"",{"$nulls":5},{"v":86,"d":"86 m"},null,86.0000000000001,"m",{"v":1.3,"d":"1.30"},{"v":3.663128491620116,"d":"3.66"},{"v":0.13541666666666652,"d":"13.54%"},{"v":36.36871508379893,"d":"36 m"},{"v":46.39883906085822,"d":"46 m"},"","Pne>à35m",{"v":13.541666666666652,"d":"13.54 "},{"v":86.45833333333334,"d":"86.458"},{"v":38.15758845437617,"d":"38.158 "},{"v":48.30074487895718,"d":"48.301 "},{"v":100,"d":"100 "}]
[9.70000000000001,"",{"$nulls":5},{"v":87,"d":"87 m"},null,87.0000000000001,"m",{"v":1.3,"d":"1.30"},{"v":3.7072625698324067,"d":"3.71"},{"v":0.1340206185567009,"d":"13.40%"},{"v":36.92737430167603,"d":"37 m"},{"v":46.904608389600135,"d":"47 m"},"","Pne>à35m",{"v":13.40206185567009,"d":"13.40 "},{"v":86.59793814432992,"d":"86.598"},{"v":38.219201750849514,"d":"38.219 "},{"v":48.378736393480395,"d":"48.379 "},{"v":99.99999999999999,"d":"100 "}]
[9.8,"",{"$nulls":5},{"v":88,"d":"88 m"},null,88,"m",{"v":1.3,"d":"1.30"},{"v":3.7513966480446923,"d":"3.75"},{"v":0.1326530612244898,"d":"13.27%"},{"v":37.48603351955307,"d":"37 m"},{"v":47.41037771834199,"d":"47 m"},"","Pne>à35m",{"v":13.26530612244898,"d":"13.27 "},{"v":86.73469387755102,"d":"86.735"},{"v":38.27955763310911,"d":"38.280 "},{"v":48.45513624444192,"d":"48.455 "},{"v":100,"d":"100 "}]
[9.9,"",{"$nulls":5},{"v":89,"d":"89 m"},null,89,"m",{"v":1.3,"d":"1.30"},{"v":3.795530726256983,"d":"3.80"},{"v":0.13131313131313133,"d":"13.13%"},{"v":38.04469273743017,"d":"38 m"},{"v":47.9161470470839,"d":"48 m"},"","Pne>à35m",{"v":13.131313131313133,"d":"13.13 "},{"v":86.86868686868686,"d":"86.869"},{"v":38.33869420461599,"d":"38.339 "},{"v":48.529992664070875,"d":"48.530 "},{"v":100,"d":"100 "}]
[{"v":10,"d":"10.0"},"",{"$nulls":5},{"v":90,"d":"90 m"},null,90,"m",{"v":1.3,"d":"1.30"},{"v":3.839664804469274,"d":"3.84"},{"v":0.13,"d":"13.00%"},{"v":38.60335195530726,"d":"39 m"},{"v":48.4219163758258,"d":"48 m"},"","Pne>à35m",{"$f":"$Q$44/A140*100","v":{"v":13,"d":"13.00 "}},{"v":87,"d":"87.000"},{"v":38.39664804469274,"d":"38.397 "},{"v":48.60335195530726,"d":"48.603 "},{"v":100,"d":"100 "}]
[10.1,"",{"$nulls":5},{"v":91,"d":"91 m"},null,91,"m",{"v":1.3,"d":"1.30"},{"v":3.883798882681564,"d":"3.88"},{"v":0.12871287128712872,"d":"12.87%"},{"v":39.162011173184354,"d":"39 m"},{"v":48.92768570456769,"d":"49 m"},"","Pne>à35m",{"v":12.871287128712872,"d":"12.87 "},{"v":87.12871287128712,"d":"87.129"},{"v":38.45345428397588,"d":"38.453 "},{"v":48.67525858731125,"d":"48.675 "},{"v":100,"d":"100 "}]
[10.2,"",{"$nulls":5},{"v":92,"d":"92 m"},null,92,"m",{"v":1.3,"d":"1.30"},{"v":3.927932960893854,"d":"3.93"},{"v":0.12745098039215688,"d":"12.75%"},{"v":39.72067039106144,"d":"40 m"},{"v":49.433455033309606,"d":"49 m"},"","Pne>à35m",{"v":12.745098039215689,"d":"12.75 "},{"v":87.25490196078431,"d":"87.255"},{"v":38.509146675429946,"d":"38.509 "},{"v":48.74575528535436,"d":"48.746 "},{"v":100,"d":"100 "}]
[10.3,"",{"$nulls":5},{"v":93,"d":"93 m"},null,93,"m",{"v":1.3,"d":"1.30"},{"v":3.972067039106146,"d":"3.97"},{"v":0.1262135922330097,"d":"12.62%"},{"v":40.27932960893855,"d":"40 m"},{"v":49.93922436205152,"d":"50 m"},"","Pne>à35m",{"v":12.62135922330097,"d":"12.62 "},{"v":87.37864077669903,"d":"87.379"},{"v":38.56375766122471,"d":"38.564 "},{"v":48.814883115474316,"d":"48.815 "},{"v":100,"d":"100 "}]
[10.4,"",{"$nulls":5},{"v":94,"d":"94 m"},null,94,"m",{"v":1.3,"d":"1.30"},{"v":4.0162011173184355,"d":"4.02"},{"v":0.125,"d":"12.50%"},{"v":40.83798882681563,"d":"41 m"},{"v":50.44499369079341,"d":"50 m"},"","Pne>à35m",{"v":12.5,"d":"12.50 "},{"v":87.5,"d":"87.500"},{"v":38.617318435754186,"d":"38.617 "},{"v":48.882681564245814,"d":"48.883 "},{"v":100,"d":"100 "}]
[10.5,"",{"$nulls":5},{"v":95,"d":"95 m"},null,95,"m",{"v":1.3,"d":"1.30"},{"v":4.060335195530726,"d":"4.06"},{"v":0.12380952380952381,"d":"12.38%"},{"v":41.39664804469273,"d":"41 m"},{"v":50.95076301953532,"d":"51 m"},"","Pne>à35m",{"v":12.380952380952381,"d":"12.38 "},{"v":87.61904761904762,"d":"87.619"},{"v":38.66985900505453,"d":"38.670 "},{"v":48.94918861399309,"d":"48.949 "},{"v":100,"d":"100 "}]
[10.6,"",{"$nulls":5},{"v":96,"d":"96 m"},null,96,"m",{"v":1.3,"d":"1.30"},{"v":4.104469273743016,"d":"4.10"},{"v":0.12264150943396228,"d":"12.26%"},{"v":41.95530726256981,"d":"42 m"},{"v":51.45653234827723,"d":"51 m"},"","Pne>à35m",{"v":12.264150943396228,"d":"12.26 "},{"v":87.73584905660377,"d":"87.736"},{"v":38.721408242858644,"d":"38.721 "},{"v":49.014440813745125,"d":"49.014 "},{"v":100,"d":"100 "}]
[10.7,"",{"$nulls":5},{"v":97,"d":"97 m"},null,97,"m",{"v":1.3,"d":"1.30"},{"v":4.148603351955307,"d":"4.15"},{"v":0.12149532710280375,"d":"12.15%"},{"v":42.513966480446925,"d":"43 m"},{"v":51.96230167701913,"d":"52 m"},"","Pne>à35m",{"v":12.149532710280376,"d":"12.15 "},{"v":87.85046728971963,"d":"87.850"},{"v":38.771993943507546,"d":"38.772 "},{"v":49.07847334621208,"d":"49.078 "},{"v":100,"d":"100 "}]
[10.8,"",{"$nulls":5},{"v":98,"d":"98 m"},null,98,"m",{"v":1.3,"d":"1.30"},{"v":4.192737430167598,"d":"4.19"},{"v":0.12037037037037036,"d":"12.04%"},{"v":43.07262569832402,"d":"43 m"},{"v":52.46807100576105,"d":"52 m"},"","Pne>à35m",{"v":12.037037037037036,"d":"12.04 "},{"v":87.96296296296296,"d":"87.963"},{"v":38.8216428719222,"d":"38.822 "},{"v":49.14132009104076,"d":"49.141 "},{"v":100,"d":"100 "}]
[10.9,"",{"$nulls":5},{"v":99,"d":"99 m"},null,99,"m",{"v":1.3,"d":"1.30"},{"v":4.236871508379888,"d":"4.24"},{"v":0.11926605504587157,"d":"11.93%"},{"v":43.63128491620112,"d":"44 m"},{"v":52.97384033450295,"d":"53 m"},"","Pne>à35m",{"v":11.926605504587156,"d":"11.93 "},{"v":88.07339449541284,"d":"88.073"},{"v":38.87038081082466,"d":"38.870 "},{"v":49.20301368458818,"d":"49.203 "},{"v":100,"d":"100 "}]
[{"v":11,"d":"11.0"},"",{"$nulls":5},{"v":100,"d":"100 m"},null,100,"m",{"v":1.3,"d":"1.30"},{"v":4.281005586592179,"d":"4.28"},{"v":0.11818181818181818,"d":"11.82%"},{"v":44.18994413407821,"d":"44 m"},{"v":53.47960966324486,"d":"53 m"},"","Pne>à35m",{"v":11.818181818181818,"d":"11.82 "},{"v":88.18181818181819,"d":"88.182"},{"v":38.918232605383444,"d":"38.918 "},{"v":49.263585576434735,"d":"49.264 "},{"v":100,"d":"100 "}]
[11.1,"",{"$nulls":5},{"v":101,"d":"101 m"},null,101,"m",{"v":1.3,"d":"1.30"},{"v":4.325139664804468,"d":"4.33"},{"v":0.11711711711711713,"d":"11.71%"},{"$f":"IF(M151=\"\",\"\",IF(M151<0,\"!\",IF(M151<0.79,0,(10*M151)/0.79-7.9/0.79)))","v":{"v":44.74860335195529,"d":"45 m"}},{"v":53.98537899198676,"d":"54 m"},"","Pne>à35m",{"$f":"$Q$44/A151*100","v":{"v":11.711711711711713,"d":"11.71 "}},{"v":88.28828828828829,"d":"88.288"},{"v":38.96522220544566,"d":"38.965 "},{"v":49.32306608284262,"d":"49.323 "},{"v":100,"d":"100 "}]
[11.2,"",{"$nulls":5},{"v":102,"d":"102 m"},null,102,"m",{"v":1.3,"d":"1.30"},{"v":4.369273743016759,"d":"4.37"},{"v":0.11607142857142859,"d":"11.61%"},{"v":45.30726256983239,"d":"45 m"},{"v":54.491148320728655,"d":"54 m"},"","Pne>à35m",{"v":11.60714285714286,"d":"11.61 "},{"v":88.39285714285714,"d":"88.393"},{"v":39.01137270550678,"d":"39.011 "},{"v":49.38148443735036,"d":"49.381 "},{"v":100,"d":"100 "}]
[11.3,"",{"$nulls":5},{"v":103,"d":"103 m"},null,103,"m",{"v":1.3,"d":"1.30"},{"v":4.41340782122905,"d":"4.41"},{"v":0.11504424778761062,"d":"11.50%"},{"v":45.865921787709496,"d":"46 m"},{"v":54.99691764947056,"d":"55 m"},"","Pne>à35m",{"v":11.504424778761061,"d":"11.50 "},{"v":88.49557522123894,"d":"88.496"},{"v":39.05670638255796,"d":"39.057 "},{"v":49.438868838680975,"d":"49.439 "},{"v":100,"d":"100 "}]
[11.4,"",{"$nulls":5},{"v":104,"d":"104 m"},null,104,"m",{"v":1.3,"d":"1.30"},{"v":4.457541899441341,"d":"4.46"},{"v":0.11403508771929824,"d":"11.40%"},{"v":46.424581005586596,"d":"46 m"},{"v":55.502686978212466,"d":"56 m"},"","Pne>à35m",{"v":11.403508771929824,"d":"11.40 "},{"v":88.59649122807018,"d":"88.596"},{"v":39.101244731941584,"d":"39.101 "},{"v":49.495246496128594,"d":"49.495 "},{"v":100,"d":"100 "}]
[11.5,"",{"$nulls":5},{"v":105,"d":"105 m"},null,105,"m",{"v":1.3,"d":"1.30"},{"v":4.501675977653631,"d":"4.50"},{"v":0.11304347826086956,"d":"11.30%"},{"v":46.983240223463675,"d":"47 m"},{"v":56.00845630695437,"d":"56 m"},"","Pne>à35m",{"v":11.304347826086957,"d":"11.30 "},{"v":88.69565217391305,"d":"88.696"},{"v":39.14500850133592,"d":"39.145 "},{"v":49.550643672577124,"d":"49.551 "},{"v":100,"d":"100 "}]
[11.6,"",{"$nulls":5},{"v":106,"d":"106 m"},null,106,"m",{"v":1.3,"d":"1.30"},{"v":4.545810055865921,"d":"4.55"},{"v":0.11206896551724138,"d":"11.21%"},{"v":47.541899441340775,"d":"48 m"},{"v":56.51422563569628,"d":"57 m"},"","Pne>à35m",{"v":11.206896551724139,"d":"11.21 "},{"v":88.79310344827586,"d":"88.793"},{"v":39.18801772298208,"d":"39.188 "},{"v":49.605085725293776,"d":"49.605 "},{"v":100,"d":"100 "}]
[11.7,"",{"$nulls":5},{"v":107,"d":"107 m"},null,107,"m",{"v":1.3,"d":"1.30"},{"v":4.589944134078212,"d":"4.59"},{"v":0.11111111111111112,"d":"11.11%"},{"v":48.10055865921787,"d":"48 m"},{"v":57.01999496443818,"d":"57 m"},"","Pne>à35m",{"v":11.111111111111112,"d":"11.11 "},{"v":88.88888888888889,"d":"88.889"},{"v":39.230291744258224,"d":"39.230 "},{"v":49.65859714463066,"d":"49.659 "},{"v":100,"d":"100 "}]
[11.8,"",{"$nulls":5},{"v":108,"d":"108 m"},null,108,"m",{"$f":"IF($F$47=\"oc\",IF(A158*$E$20/100>$Q$44,A158*$E$20/100,$Q$44),$Q$44)","v":{"v":1.3,"d":"1.30"}},{"v":4.634078212290503,"d":"4.63"},{"v":0.11016949152542371,"d":"11.02%"},{"v":48.659217877094974,"d":"49 m"},{"v":57.52576429318009,"d":"58 m"},"","Pne>à35m",{"$f":"$Q$44/A158*100","v":{"v":11.016949152542372,"d":"11.02 "}},{"v":88.98305084745763,"d":"88.983"},{"v":39.27184925669918,"d":"39.272 "},{"v":49.71120159075845,"d":"49.711 "},{"v":100,"d":"100 "}]
[11.9,{"$f":"IF(A159*$E$20/100>$Q$44,\"PP02 rinçage ou OC > set point, taper OC en F47\",\"\")","v":""},{"$nulls":5},{"v":109,"d":"109 m"},null,109,{"$f":"IF(J159=\"OC ou\",\" rinçage  =\",\"m\")","v":"m"},{"v":1.3,"d":"1.30"},{"v":4.678212290502794,"d":"4.68"},{"v":0.1092436974789916,"d":"10.92%"},{"v":49.21787709497207,"d":"49 m"},{"v":58.031533621921994,"d":"58 m"},{"$f":"IF(O159>(A159*10)-10,\"Pne>P\",IF(L159>1.5,\"hyperoxie\",\"\"))","v":""},"Pne>à35m",{"v":10.92436974789916,"d":"10.92 "},{"v":89.07563025210084,"d":"89.076"},{"v":39.31270832355288,"d":"39.313 "},{"v":49.762921928547954,"d":"49.763 "},{"v":100,"d":"100 "}]
[{"v":12,"d":"12.0"},"",{"$nulls":5},{"v":110,"d":"110 m"},null,110,"m",{"v":1.3,"d":"1.30"},{"v":4.722346368715084,"d":"4.72"},{"v":0.10833333333333334,"d":"10.83%"},{"v":49.77653631284916,"d":"50 m"},{"v":58.537302950663914,"d":"59 m"},"","Pne>à35m",{"v":10.833333333333334,"d":"10.83 "},{"v":89.16666666666667,"d":"89.167"},{"v":39.35288640595903,"d":"39.353 "},{"v":49.81378026070763,"d":"49.814 "},{"v":99.99999999999999,"d":"100 "}]
[12.1,"",{"$nulls":5},{"v":111,"d":"111 m"},null,111,"m",{"v":1.3,"d":"1.30"},{"v":4.766480446927374,"d":"4.77"},{"v":0.10743801652892562,"d":"10.74%"},{"v":50.33519553072625,"d":"50 m"},{"v":59.043072279405806,"d":"59 m"},"","Pne>à35m",{"v":10.743801652892563,"d":"10.74 "},{"v":89.25619834710744,"d":"89.256"},{"v":39.39240038782954,"d":"39.392 "},{"v":49.863797959277896,"d":"49.864 "},{"v":100,"d":"100 "}]
[12.2,"",{"$nulls":5},{"v":112,"d":"112 m"},null,112,"m",{"v":1.3,"d":"1.30"},{"v":4.8106145251396635,"d":"4.81"},{"v":0.10655737704918034,"d":"10.66%"},{"v":50.89385474860333,"d":"51 m"},{"v":59.54884160814771,"d":"60 m"},"","Pne>à35m",{"v":10.655737704918034,"d":"10.66 "},{"v":89.34426229508196,"d":"89.344"},{"v":39.43126659950544,"d":"39.431 "},{"v":49.91299569557653,"d":"49.913 "},{"v":100,"d":"100 "}]
[12.3,"",{"$nulls":5},{"v":113,"d":"113 m"},null,113,"m",{"v":1.3,"d":"1.30"},{"v":4.854748603351956,"d":"4.85"},{"v":0.1056910569105691,"d":"10.57%"},{"v":51.45251396648045,"d":"51 m"},{"v":60.05461093688963,"d":"60 m"},"","Pne>à35m",{"v":10.56910569105691,"d":"10.57 "},{"v":89.4308943089431,"d":"89.431"},{"v":39.4695008402598,"d":"39.470 "},{"v":49.96139346868329,"d":"49.961 "},{"v":100,"d":"100 "}]
[12.4,"PP02 rinçage ou OC > set point, taper OC en F47",{"$nulls":5},{"v":114,"d":"114 m"},null,"OC ou"," rinçage  =",{"v":1.3020000000000003,"d":"1.30"},{"v":4.898,"d":"4.90"},{"v":0.10500000000000002,"d":"10.50%"},{"v":51.99999999999999,"d":"52 m"},{"v":60.57244947101867,"d":"61 m"},"","Pne>à35m",{"v":10.483870967741936,"d":"10.48 "},{"v":89.51612903225806,"d":"89.516"},{"v":39.50711839971166,"d":"39.507 "},{"v":50.009010632546406,"d":"50.009 "},{"v":100,"d":"100 "}]
[12.5,"PP02 rinçage ou OC > set point, taper OC en F47",{"$nulls":5},{"v":115,"d":"115 m"},null,"OC ou"," rinçage  =",{"v":1.3125,"d":"1.31"},{"v":4.9375,"d":"4.94"},{"v":0.105,"d":"10.50%"},{"v":52.5,"d":"53 m"},{"v":61.14158212804301,"d":"61 m"},"","Pne>à35m",{"v":10.4,"d":"10.40 "},{"v":89.6,"d":"89.600"},{"v":39.54413407821229,"d":"39.544 "},{"v":50.05586592178771,"d":"50.056 "},{"v":100,"d":"100 "}]
[12.6,"PP02 rinçage ou OC > set point, taper OC en F47",{"$nulls":5},{"v":116,"d":"116 m"},null,"OC ou"," rinçage  =",{"v":1.3229999999999997,"d":"1.32"},{"v":4.977,"d":"4.98"},{"v":0.10499999999999998,"d":"10.50%"},{"v":53,"d":"53 m"},{"v":61.71071478506735,"d":"62 m"},"","Pne>à35m",{"v":10.317460317460318,"d":"10.32 "},{"v":89.68253968253968,"d":"89.683"},{"v":39.58056220626053,"d":"39.581 "},{"v":50.10197747627915,"d":"50.102 "},{"v":100,"d":"100 "}]
[12.7,"PP02 rinçage ou OC > set point, taper OC en F47",{"$nulls":5},{"v":117,"d":"117 m"},null,"OC ou"," rinçage  =",{"v":1.3335,"d":"1.33"},{"v":5.0165,"d":"5.02"},{"v":0.105,"d":"10.50%"},{"v":53.49999999999999,"d":"54 m"},{"v":62.27984744209169,"d":"62 m"},"","Pne>à35m",{"v":10.236220472440946,"d":"10.24 "},{"v":89.76377952755905,"d":"89.764"},{"v":39.61641666300092,"d":"39.616 "},{"v":50.14736286455813,"d":"50.147 "},{"v":100,"d":"100 "}]
[12.8,"PP02 rinçage ou OC > set point, taper OC en F47",{"$nulls":5},{"v":118,"d":"118 m"},null,"OC ou"," rinçage  =",{"v":1.344,"d":"1.34"},{"v":5.056,"d":"5.06"},{"v":0.105,"d":"10.50%"},{"v":54,"d":"54 m"},{"v":62.84898009911605,"d":"63 m"},"","Pne>à35m",{"v":10.15625,"d":"10.16 "},{"v":89.84375,"d":"89.844"},{"v":39.65171089385475,"d":"39.652 "},{"v":50.19203910614525,"d":"50.192 "},{"v":100,"d":"100 "}]
[12.9,"PP02 rinçage ou OC > set point, taper OC en F47",{"$nulls":5},{"v":119,"d":"119 m"},null,"OC ou"," rinçage  =",{"v":1.3545000000000003,"d":"1.35"},{"v":5.0955,"d":"5.10"},{"v":0.10500000000000002,"d":"10.50%"},{"v":54.5,"d":"55 m"},{"v":63.41811275614039,"d":"63 m"},"","Pne>à35m",{"v":10.077519379844961,"d":"10.08 "},{"v":89.92248062015504,"d":"89.922"},{"v":39.68645792733099,"d":"39.686 "},{"v":50.23602269282405,"d":"50.236 "},{"v":100,"d":"100 "}]
[13,"PP02 rinçage ou OC > set point, taper OC en F47",{"$nulls":5},{"v":120,"d":"120 m"},null,"OC ou"," rinçage  =",{"v":1.365,"d":"1.37"},{"v":5.135,"d":"5.14"},{"v":0.105,"d":"10.50%"},{"v":54.999999999999986,"d":"55 m"},{"v":63.98724541316474,"d":"64 m"},"","Pne>à35m",{"v":10,"d":"10.00 "},{"v":90,"d":"90.000"},{"v":39.720670391061454,"d":"39.721 "},{"v":50.279329608938546,"d":"50.279 "},{"v":100,"d":"100 "}]
[13.1,"PP02 rinçage ou OC > set point, taper OC en F47",{"$nulls":5},{"v":121,"d":"121 m"},null,"OC ou"," rinçage  =",{"v":1.3754999999999997,"d":"1.38"},{"v":5.174499999999999,"d":"5.17"},{"v":0.10499999999999998,"d":"10.50%"},{"v":55.499999999999986,"d":"56 m"},{"v":64.55637807018908,"d":"65 m"},"","Pne>à35m",{"v":9.923664122137406,"d":"9.92 "},{"v":90.07633587786259,"d":"90.076"},{"v":39.75436052710136,"d":"39.754 "},{"v":50.321975350761235,"d":"50.322 "},{"v":100,"d":"100 "}]
[13.2,"PP02 rinçage ou OC > set point, taper OC en F47",{"$nulls":5},{"v":122,"d":"122 m"},null,"OC ou"," rinçage  =",{"v":1.386,"d":"1.39"},{"v":5.2139999999999995,"d":"5.21"},{"v":0.105,"d":"10.50%"},{"v":55.999999999999986,"d":"56 m"},{"v":65.12551072721342,"d":"65 m"},"","Pne>à35m",{"v":9.84848484848485,"d":"9.85 "},{"v":90.15151515151516,"d":"90.152"},{"v":39.78754020653462,"d":"39.788 "},{"v":50.36397494498053,"d":"50.364 "},{"v":100,"d":"100 "}]
[13.3,"PP02 rinçage ou OC > set point, taper OC en F47",{"$nulls":5},{"v":123,"d":"123 m"},null,"OC ou"," rinçage  =",{"v":1.3965,"d":"1.40"},{"v":5.2535,"d":"5.25"},{"v":0.105,"d":"10.50%"},{"v":56.499999999999986,"d":"57 m"},{"v":65.69464338423776,"d":"66 m"},"","Pne>à35m",{"v":9.774436090225564,"d":"9.77 "},{"v":90.22556390977444,"d":"90.226"},{"v":39.820220943420004,"d":"39.820 "},{"v":50.40534296635443,"d":"50.405 "},{"v":100,"d":"100 "}]
[13.4,"PP02 rinçage ou OC > set point, taper OC en F47",{"$nulls":5},{"v":124,"d":"124 m"},null,"OC ou"," rinçage  =",{"v":1.4070000000000003,"d":"1.41"},{"v":5.293000000000001,"d":"5.29"},{"v":0.10500000000000001,"d":"10.50%"},{"v":57,"d":"57 m"},{"v":66.2637760412621,"d":"66 m"},"","Pne>à35m",{"v":9.701492537313433,"d":"9.70 "},{"v":90.29850746268657,"d":"90.299"},{"v":39.852413908113064,"d":"39.852 "},{"v":50.4460935545735,"d":"50.446 "},{"v":99.99999999999999,"d":"100 "}]
[13.5,"PP02 rinçage ou OC > set point, taper OC en F47",{"$nulls":5},{"v":125,"d":"125 m"},null,"OC ou"," rinçage  =",{"v":1.4175,"d":"1.42"},{"v":5.3325,"d":"5.33"},{"v":0.105,"d":"10.50%"},{"v":57.499999999999986,"d":"58 m"},{"v":66.83290869828645,"d":"67 m"},"","Pne>à35m",{"v":9.62962962962963,"d":"9.63 "},{"v":90.37037037037037,"d":"90.370"},{"v":39.88412993999586,"d":"39.884 "},{"v":50.48624043037451,"d":"50.486 "},{"v":100,"d":"100 "}]
[13.6,"PP02 rinçage ou OC > set point, taper OC en F47",{"$nulls":5},{"v":126,"d":"126 m"},null,"OC ou"," rinçage  =",{"v":1.428,"d":"1.43"},{"v":5.371999999999999,"d":"5.37"},{"v":0.105,"d":"10.50%"},{"v":57.999999999999986,"d":"58 m"},{"v":67.40204135531079,"d":"67 m"},"","Pne>à35m",{"v":9.558823529411766,"d":"9.56 "},{"v":90.44117647058823,"d":"90.441"},{"v":39.91537955964508,"d":"39.915 "},{"v":50.52579691094315,"d":"50.526 "},{"v":100,"d":"100 "}]
[13.7,"PP02 rinçage ou OC > set point, taper OC en F47",{"$nulls":5},{"v":127,"d":"127 m"},null,"OC ou"," rinçage  =",{"v":1.4385,"d":"1.44"},{"v":5.4115,"d":"5.41"},{"v":0.105,"d":"10.50%"},{"v":58.5,"d":"59 m"},{"v":67.97117401233513,"d":"68 m"},"","Pne>à35m",{"v":9.489051094890511,"d":"9.49 "},{"v":90.51094890510949,"d":"90.511"},{"v":39.94617298046732,"d":"39.946 "},{"v":50.56477592464217,"d":"50.565 "},{"v":100,"d":"100 "}]
[13.8,"PP02 rinçage ou OC > set point, taper OC en F47",{"$nulls":5},{"v":128,"d":"128 m"},null,"OC ou"," rinçage  =",{"v":1.449,"d":"1.45"},{"v":5.4510000000000005,"d":"5.45"},{"v":0.105,"d":"10.50%"},{"v":59,"d":"59 m"},{"v":68.5403066693595,"d":"69 m"},"","Pne>à35m",{"v":9.420289855072465,"d":"9.42 "},{"v":90.57971014492753,"d":"90.580"},{"v":39.97652011982835,"d":"39.977 "},{"v":50.60319002509918,"d":"50.603 "},{"v":100,"d":"100 "}]
[13.9,"PP02 rinçage ou OC > set point, taper OC en F47",{"$nulls":5},{"v":129,"d":"129 m"},null,"OC ou"," rinçage  =",{"v":1.4595000000000002,"d":"1.46"},{"v":5.490500000000001,"d":"5.49"},{"v":0.10500000000000001,"d":"10.50%"},{"v":59.500000000000014,"d":"60 m"},{"v":69.10943932638384,"d":"69 m"},"","Pne>à35m",{"v":9.352517985611511,"d":"9.35 "},{"v":90.64748201438849,"d":"90.647"},{"v":40.00643060970218,"d":"40.006 "},{"$f":"100-(S179+U179)","v":{"v":50.64105140468631,"d":"50.641 "}},{"$f":"V179+U179+S179","v":{"v":100,"d":"100 "}}]
[14,"PP02 rinçage ou OC > set point, taper OC en F47",{"$nulls":5},{"v":130,"d":"130 m"},null,"OC ou"," rinçage  =",1.47,5.53,{"v":0.105,"d":"10.50%"},{"v":60,"d":"60 m"},{"$f":"IF(J180=\"OC ou\",(((((($E$20%*1.428)+($F$20%*0.178)+($D$23%*1.25))*A180))/1.28738)*10)-10,((((((S180%*1.428)+(V180%*0.178)+(U180%*1.25))*A180))/1.28738)*10)-10)","v":{"v":69.67857198340818,"d":"70 m"}},"","Pne>à35m",{"v":9.285714285714286,"d":"9.29 "},{"v":90.71428571428571,"d":"90.714"},{"v":40.035913806863526,"d":"40.036 "},{"v":50.67837190742219,"d":"50.678 "},{"v":100.00000000000001,"d":"100 "}]
[14.1,"PP02 rinçage ou OC > set point, taper OC en F47",{"$nulls":5},{"v":131,"d":"131 m"},null,"OC ou"," rinçage  =",{"v":1.4805,"d":"1.48"},{"v":5.5695,"d":"5.57"},{"v":0.105,"d":"10.50%"},{"v":60.499999999999986,"d":"61 m"},{"v":70.24770464043252,"d":"70 m"},"","Narcose",{"v":9.21985815602837,"d":"9.22 "},{"v":90.78014184397163,"d":"90.780"},{"v":40.0649788026467,"d":"40.065 "},{"v":50.71516304132493,"d":"50.715 "},{"v":99.99999999999999,"d":"100 "}]
[14.2,"PP02 rinçage ou OC > set point, taper OC en F47",{"$nulls":5},{"v":132,"d":"132 m"},null,"OC ou"," rinçage  =",{"v":1.4909999999999999,"d":"1.49"},{"v":5.609,"d":"5.61"},{"v":0.105,"d":"10.50%"},{"v":61,"d":"61 m"},{"v":70.81683729745686,"d":"71 m"},"","Narcose",{"v":9.15492957746479,"d":"9.15 "},{"v":90.84507042253522,"d":"90.845"},{"v":40.09363443229208,"d":"40.094 "},{"v":50.75143599024313,"d":"50.751 "},{"v":99.99999999999999,"d":"100 "}]
[14.3,"PP02 rinçage ou OC > set point, taper OC en F47",{"$nulls":5},{"v":133,"d":"133 m"},null,"OC ou"," rinçage  =",{"v":1.5015,"d":"1.50"},{"v":5.6485,"d":"5.65"},{"v":0.105,"d":"10.50%"},{"v":61.5,"d":"62 m"},{"v":71.3859699544812,"d":"71 m"},"hyperoxie","Narcose",{"v":9.090909090909092,"d":"9.09 "},{"v":90.9090909090909,"d":"90.909"},{"v":40.12188928390045,"d":"40.122 "},{"v":50.787201625190455,"d":"50.787 "},{"v":100,"d":"100 "}]
[14.4,"PP02 rinçage ou OC > set point, taper OC en F47",{"$nulls":5},{"v":134,"d":"134 m"},null,"OC ou"," rinçage  =",{"v":1.5120000000000002,"d":"1.51"},{"v":5.688000000000001,"d":"5.69"},{"v":0.10500000000000001,"d":"10.50%"},{"v":62.000000000000014,"d":"62 m"},{"$f":"IF(J184=\"OC ou\",(((((($E$20%*1.428)+($F$20%*0.178)+($D$23%*1.25))*A184))/1.28738)*10)-10,((((((S184%*1.428)+(V184%*0.178)+(U184%*1.25))*A184))/1.28738)*10)-10)","v":{"v":71.95510261150554,"d":"72 m"}},"hyperoxie","Narcose",{"v":9.027777777777777,"d":"9.03 "},{"v":90.97222222222223,"d":"90.972"},{"v":40.149751707014275,"d":"40.150 "},{"v":50.82247051520795,"d":"50.822 "},{"v":100,"d":"100 "}]
[14.5,"PP02 rinçage ou OC > set point, taper OC en F47",{"$nulls":5},{"v":135,"d":"135 m"},null,{"$f":"IF($F$47=\"oc\",IF($E$20>S185,\"OC ou\",(A185-1)*10),(A185-1)*10)","v":"OC ou"}," rinçage  =",{"v":1.5225,"d":"1.52"},{"v":5.7275,"d":"5.73"},{"v":0.105,"d":"10.50%"},{"v":62.5,"d":"63 m"},{"$f":"IF(J185=\"OC ou\",(((((($E$20%*1.428)+($F$20%*0.178)+($D$23%*1.25))*A185))/1.28738)*10)-10,((((((S185%*1.428)+(V185%*0.178)+(U185%*1.25))*A185))/1.28738)*10)-10)","v":{"v":72.52423526852988,"d":"73 m"}},"hyperoxie","Narcose",{"v":8.96551724137931,"d":"8.97 "},{"$f":"100-S185","v":{"v":91.0344827586207,"d":"91.034"}},{"$f":"T185/($T$47+1)","v":{"v":40.17722982084377,"d":"40.177 "}},{"v":50.85725293777692,"d":"50.857 "},{"v":100,"d":"100 "}]
[14.6,"PP02 rinçage ou OC > set point, taper OC en F47",{"$nulls":5},{"v":136,"d":"136 m"},null,"OC ou"," rinçage  =",{"v":1.533,"d":"1.53"},{"$f":"IF($R$47=0,0,IF(K186=\"m\",U186*A186/100,$R$47*A186/100))","v":{"v":5.7669999999999995,"d":"5.77"}},{"$f":"IF(K186=\"m\",S186/100,L186/A186)","v":{"v":0.105,"d":"10.50%"}},{"v":62.999999999999986,"d":"63 m"},{"v":73.09336792555422,"d":"73 m"},"hyperoxie",{"$f":"IF(M186>5.53,\"Narcose\",IF(M186>3.56,\"Pne>à35m\",\"\"))","v":"Narcose"},{"v":8.904109589041097,"d":"8.90 "},{"v":91.0958904109589,"d":"91.096"},{"v":40.204331522155044,"d":"40.204 "},{"v":50.89155888880386,"d":"50.892 "},{"v":100,"d":"100 "}]
[14.7,"PP02 rinçage ou OC > set point, taper OC en F47",{"$nulls":5},{"v":137,"d":"137 m"},null,"OC ou"," rinçage  =",{"v":1.5434999999999999,"d":"1.54"},{"v":5.8065,"d":"5.81"},{"v":0.105,"d":"10.50%"},{"v":63.5,"d":"64 m"},{"v":73.66250058257859,"d":"74 m"},"hyperoxie","Narcose",{"v":8.843537414965986,"d":"8.84 "},{"v":91.156462585034,"d":"91.156"},{"v":40.23106449283624,"d":"40.231 "},{"v":50.925398092197774,"d":"50.925 "},{"v":100,"d":"100 "}]
[14.8,"PP02 rinçage ou OC > set point, taper OC en F47",{"$nulls":5},{"v":138,"d":"138 m"},null,"OC ou"," rinçage  =",{"v":1.554,"d":"1.55"},{"v":5.846,"d":"5.85"},{"v":0.105,"d":"10.50%"},{"v":64,"d":"64 m"},{"v":74.23163323960293,"d":"74 m"},"hyperoxie","Narcose",{"v":8.783783783783784,"d":"8.78 "},{"v":91.21621621621621,"d":"91.216"},{"v":40.25743620715687,"d":"40.257 "},{"v":50.958780009059346,"d":"50.959 "},{"v":100.00000000000001,"d":"100 "}]
[14.9,"PP02 rinçage ou OC > set point, taper OC en F47",{"$nulls":5},{"v":139,"d":"139 m"},null,"OC ou"," rinçage  =",{"v":1.5645000000000002,"d":"1.56"},{"v":5.8855,"d":"5.89"},{"v":0.10500000000000001,"d":"10.50%"},{"v":64.5,"d":"65 m"},{"v":74.80076589662728,"d":"75 m"},"hyperoxie","Narcose",{"v":8.724832214765101,"d":"8.72 "},{"v":91.2751677852349,"d":"91.275"},{"v":40.28345393873495,"d":"40.283 "},{"v":50.99171384649995,"d":"50.992 "},{"v":100,"d":"100 "}]
[15,"PP02 rinçage ou OC > set point, taper OC en F47",{"$nulls":5},{"v":140,"d":"140 m"},null,"OC ou"," rinçage  =",{"$f":"IF($F$47=\"oc\",IF(A190*$E$20/100>$Q$44,A190*$E$20/100,$Q$44),$Q$44)","v":{"v":1.575,"d":"1.58"}},{"v":5.925,"d":"5.93"},{"v":0.105,"d":"10.50%"},{"$f":"IF(M190=\"\",\"\",IF(M190<0,\"!\",IF(M190<0.79,0,(10*M190)/0.79-7.9/0.79)))","v":{"v":65,"d":"65 m"}},{"v":75.36989855365162,"d":"75 m"},"hyperoxie","Narcose",{"v":8.666666666666668,"d":"8.67 "},{"v":91.33333333333333,"d":"91.333"},{"v":40.30912476722532,"d":"40.309 "},{"v":51.024208566108015,"d":"51.024 "},{"v":100.00000000000001,"d":"100 "}]
[15.1,"PP02 rinçage ou OC > set point, taper OC en F47",{"$nulls":5},{"v":141,"d":"141 m"},null,"OC ou"," rinçage  =",{"v":1.5855,"d":"1.59"},{"v":5.964499999999999,"d":"5.96"},{"v":0.105,"d":"10.50%"},{"v":65.49999999999999,"d":"66 m"},{"v":75.93903121067596,"d":"76 m"},"hyperoxie","Narcose",{"v":8.609271523178808,"d":"8.61 "},{"v":91.3907284768212,"d":"91.391"},{"v":40.334455584742315,"d":"40.334 "},{"v":51.05627289207888,"d":"51.056 "},{"v":100,"d":"100 "}]
[15.2,"PP02 rinçage ou OC > set point, taper OC en F47",{"$nulls":5},{"v":142,"d":"142 m"},null,"OC ou"," rinçage  =",{"v":1.5959999999999999,"d":"1.60"},{"v":6.004,"d":"6.00"},{"v":0.105,"d":"10.50%"},{"v":65.99999999999999,"d":"66 m"},{"v":76.5081638677003,"d":"77 m"},"hyperoxie","Narcose",{"v":8.552631578947368,"d":"8.55 "},{"v":91.44736842105263,"d":"91.447"},{"v":40.359453102028816,"d":"40.359 "},{"v":51.087915319023814,"d":"51.088 "},{"v":100,"d":"100 "}]
[15.3,"PP02 rinçage ou OC > set point, taper OC en F47",{"$nulls":5},{"v":143,"d":"143 m"},null,"OC ou"," rinçage  =",{"v":1.6065,"d":"1.61"},{"v":6.0435,"d":"6.04"},{"v":0.105,"d":"10.50%"},{"v":66.5,"d":"67 m"},{"v":77.07729652472466,"d":"77 m"},"hyperoxie","Narcose",{"v":8.49673202614379,"d":"8.50 "},{"v":91.50326797385621,"d":"91.503"},{"v":40.38412385438347,"d":"40.384 "},{"v":51.11914411947274,"d":"51.119 "},{"v":100,"d":"100 "}]
[15.4,"PP02 rinçage ou OC > set point, taper OC en F47",{"$nulls":5},{"v":144,"d":"144 m"},null,"OC ou"," rinçage  =",{"v":1.6170000000000002,"d":"1.62"},{"v":6.083000000000001,"d":"6.08"},{"v":0.10500000000000001,"d":"10.50%"},{"v":67.00000000000001,"d":"67 m"},{"v":77.64642918174899,"d":"78 m"},"hyperoxie","Narcose",{"v":8.441558441558442,"d":"8.44 "},{"v":91.55844155844156,"d":"91.558"},{"v":40.40847420735689,"d":"40.408 "},{"v":51.14996735108467,"d":"51.150 "},{"v":100,"d":"100 "}]
[15.5,"PP02 rinçage ou OC > set point, taper OC en F47",{"$nulls":5},{"v":145,"d":"145 m"},null,"OC ou"," rinçage  =",{"v":1.6275,"d":"1.63"},{"v":6.1225,"d":"6.12"},{"v":0.105,"d":"10.50%"},{"v":67.49999999999999,"d":"68 m"},{"v":78.21556183877333,"d":"78 m"},"hyperoxie","Narcose",{"v":8.38709677419355,"d":"8.39 "},{"v":91.61290322580645,"d":"91.613"},{"v":40.432510362227426,"d":"40.433 "},{"v":51.18039286357902,"d":"51.180 "},{"v":100,"d":"100 "}]
[15.6,"PP02 rinçage ou OC > set point, taper OC en F47",{"$nulls":5},{"v":146,"d":"146 m"},null,"OC ou"," rinçage  =",{"v":1.638,"d":"1.64"},{"v":6.161999999999999,"d":"6.16"},{"v":0.105,"d":"10.50%"},{"v":67.99999999999999,"d":"68 m"},{"v":78.78469449579767,"d":"79 m"},"hyperoxie","Narcose",{"v":8.333333333333334,"d":"8.33 "},{"v":91.66666666666667,"d":"91.667"},{"v":40.456238361266294,"d":"40.456 "},{"v":51.21042830540037,"d":"51.210 "},{"v":99.99999999999999,"d":"100 "}]
[15.7,"PP02 rinçage ou OC > set point, taper OC en F47",{"$nulls":5},{"v":147,"d":"147 m"},null,"OC ou"," rinçage  =",{"v":1.6484999999999999,"d":"1.65"},{"v":6.201499999999999,"d":"6.20"},{"v":0.105,"d":"10.50%"},{"v":68.49999999999999,"d":"69 m"},{"v":79.353827152822,"d":"79 m"},"hyperoxie","Narcose",{"v":8.280254777070065,"d":"8.28 "},{"v":91.71974522292993,"d":"91.720"},{"v":40.47966409280148,"d":"40.480 "},{"v":51.24008113012846,"d":"51.240 "},{"v":100,"d":"100 "}]
[15.8,"PP02 rinçage ou OC > set point, taper OC en F47",{"$nulls":5},{"v":148,"d":"148 m"},null,"OC ou"," rinçage  =",{"v":1.659,"d":"1.66"},{"v":6.2410000000000005,"d":"6.24"},{"v":0.105,"d":"10.50%"},{"v":69,"d":"69 m"},{"v":79.92295980984636,"d":"80 m"},"hyperoxie","Narcose",{"v":8.227848101265822,"d":"8.23 "},{"v":91.77215189873418,"d":"91.772"},{"v":40.502793296089386,"d":"40.503 "},{"v":51.26935860264479,"d":"51.269 "},{"v":100,"d":"100 "}]
[15.9,"PP02 rinçage ou OC > set point, taper OC en F47",{"$nulls":5},{"v":149,"d":"149 m"},null,"OC ou"," rinçage  =",{"v":1.6695000000000002,"d":"1.67"},{"v":6.280500000000001,"d":"6.28"},{"v":0.10500000000000001,"d":"10.50%"},{"v":69.5,"d":"70 m"},{"v":80.4920924668707,"d":"80 m"},"hyperoxie","Narcose",{"v":8.176100628930817,"d":"8.18 "},{"v":91.82389937106919,"d":"91.824"},{"v":40.5256315660026,"d":"40.526 "},{"v":51.29826780506658,"d":"51.298 "},{"v":100,"d":"100 "}]
[16,"PP02 rinçage ou OC > set point, taper OC en F47",{"$nulls":5},{"v":150,"d":"150 m"},null,"OC ou"," rinçage  =",1.68,6.32,{"v":0.105,"d":"10.50%"},{"v":70,"d":"70 m"},{"v":81.06122512389506,"d":"81 m"},"hyperoxie","Narcose",{"v":8.125,"d":"8.13 "},91.875,{"v":40.5481843575419,"d":"40.548 "},{"v":51.3268156424581,"d":"51.327 "},{"v":100,"d":"100 "}]
[16.1,"PP02 rinçage ou OC > set point, taper OC en F47",{"$nulls":5},{"v":151,"d":"151 m"},null,"OC ou"," rinçage  =",{"v":1.6905000000000001,"d":"1.69"},{"v":6.359500000000001,"d":"6.36"},{"v":0.105,"d":"10.50%"},{"v":70.5,"d":"71 m"},{"v":81.6303577809194,"d":"82 m"},"hyperoxie","Narcose",{"v":8.074534161490684,"d":"8.07 "},{"v":91.92546583850931,"d":"91.925"},{"v":40.570456990180084,"d":"40.570 "},{"v":51.355008848329234,"d":"51.355 "},{"v":100.00000000000001,"d":"100 "}]
[16.2,"PP02 rinçage ou OC > set point, taper OC en F47",{"$nulls":5},{"v":152,"d":"152 m"},null,"OC ou"," rinçage  =",{"v":1.7009999999999998,"d":"1.70"},{"v":6.399,"d":"6.40"},{"v":0.105,"d":"10.50%"},{"v":71,"d":"71 m"},{"v":82.19949043794374,"d":"82 m"},"hyperoxie","Narcose",{"v":8.024691358024691,"d":"8.02 "},{"v":91.9753086419753,"d":"91.975"},{"v":40.592454652044964,"d":"40.592 "},{"v":51.38285398993035,"d":"51.383 "},{"v":100.00000000000001,"d":"100 "}]
[16.3,"PP02 rinçage ou OC > set point, taper OC en F47",{"$nulls":5},{"v":153,"d":"153 m"},null,"OC ou"," rinçage  =",{"v":1.7115,"d":"1.71"},{"v":6.4385,"d":"6.44"},{"v":0.105,"d":"10.50%"},{"v":71.5,"d":"72 m"},{"v":82.76862309496809,"d":"83 m"},"hyperoxie","Narcose",{"v":7.975460122699387,"d":"7.98 "},{"v":92.02453987730061,"d":"92.025"},{"v":40.61418240394831,"d":"40.614 "},{"v":51.4103574733523,"d":"51.410 "},{"v":100,"d":"100 "}]
[16.4,"PP02 rinçage ou OC > set point, taper OC en F47",{"$nulls":5},{"v":154,"d":"154 m"},null,"OC ou"," rinçage  =",{"v":1.722,"d":"1.72"},{"v":6.478,"d":"6.48"},{"v":0.10500000000000001,"d":"10.50%"},{"v":72,"d":"72 m"},{"v":83.33775575199242,"d":"83 m"},"hyperoxie","Narcose",{"v":7.926829268292685,"d":"7.93 "},{"v":92.07317073170732,"d":"92.073"},{"v":40.63564518326748,"d":"40.636 "},{"v":51.43752554843984,"d":"51.438 "},{"v":99.99999999999999,"d":"100 "}]
[16.5,"PP02 rinçage ou OC > set point, taper OC en F47",{"$nulls":5},{"v":155,"d":"155 m"},null,"OC ou"," rinçage  =",{"v":1.7325,"d":"1.73"},{"v":6.5175,"d":"6.52"},{"v":0.105,"d":"10.50%"},{"v":72.49999999999999,"d":"73 m"},{"v":83.90688840901677,"d":"84 m"},"hyperoxie","Narcose",{"v":7.87878787878788,"d":"7.88 "},{"v":92.12121212121212,"d":"92.121"},{"v":40.6568478076858,"d":"40.657 "},{"v":51.46436431352632,"d":"51.464 "},{"v":100,"d":"100 "}]
[16.6,"PP02 rinçage ou OC > set point, taper OC en F47",{"$nulls":5},{"v":156,"d":"156 m"},null,"OC ou"," rinçage  =",{"v":1.743,"d":"1.74"},{"v":6.557,"d":"6.56"},{"v":0.105,"d":"10.50%"},{"v":73,"d":"73 m"},{"v":84.47602106604111,"d":"84 m"},"hyperoxie","Narcose",{"v":7.83132530120482,"d":"7.83 "},{"v":92.16867469879519,"d":"92.169"},{"v":40.67779497879788,"d":"40.678 "},{"v":51.4908797199973,"d":"51.491 "},{"v":99.99999999999999,"d":"100 "}]
[16.7,"PP02 rinçage ou OC > set point, taper OC en F47",{"$nulls":5},{"v":157,"d":"157 m"},null,"OC ou"," rinçage  =",{"v":1.7534999999999998,"d":"1.75"},{"v":6.5965,"d":"6.60"},{"v":0.105,"d":"10.50%"},{"v":73.5,"d":"74 m"},{"v":85.04515372306544,"d":"85 m"},"hyperoxie","Narcose",{"v":7.784431137724551,"d":"7.78 "},{"v":92.21556886227545,"d":"92.216"},{"v":40.69849128558525,"d":"40.698 "},{"v":51.5170775766902,"d":"51.517 "},{"v":100,"d":"100 "}]
[16.8,"PP02 rinçage ou OC > set point, taper OC en F47",{"$nulls":5},{"v":158,"d":"158 m"},null,"OC ou"," rinçage  =",{"v":1.764,"d":"1.76"},{"v":6.636,"d":"6.64"},{"v":0.105,"d":"10.50%"},{"v":74,"d":"74 m"},{"v":85.6142863800898,"d":"86 m"},"hyperoxie","Narcose",{"v":7.738095238095238,"d":"7.74 "},{"v":92.26190476190476,"d":"92.262"},{"v":40.71894120776802,"d":"40.719 "},{"v":51.54296355413674,"d":"51.543 "},{"v":100,"d":"100 "}]
[16.9,"PP02 rinçage ou OC > set point, taper OC en F47",{"$nulls":5},{"v":159,"d":"159 m"},null,"OC ou"," rinçage  =",{"v":1.7745,"d":"1.77"},{"v":6.6754999999999995,"d":"6.68"},{"v":0.10500000000000001,"d":"10.50%"},{"v":74.49999999999999,"d":"75 m"},{"v":86.18341903711413,"d":"86 m"},"hyperoxie","Narcose",{"v":7.6923076923076925,"d":"7.69 "},{"v":92.3076923076923,"d":"92.308"},{"v":40.739149119037386,"d":"40.739 "},{"v":51.56854318865492,"d":"51.569 "},{"v":100,"d":"100 "}]
[17,"PP02 rinçage ou OC > set point, taper OC en F47",{"$nulls":5},{"v":160,"d":"160 m"},null,"OC ou"," rinçage  =",{"v":1.785,"d":"1.79"},{"v":6.715,"d":"6.72"},{"v":0.105,"d":"10.50%"},{"v":75,"d":"75 m"},{"v":86.7525516941385,"d":"87 m"},"hyperoxie","Narcose",{"v":7.647058823529412,"d":"7.65 "},{"v":92.3529411764706,"d":"92.353"},{"v":40.75911929017417,"d":"40.759 "},{"v":51.59382188629642,"d":"51.594 "},{"v":99.99999999999999,"d":"100 "}]
[17.1,"PP02 rinçage ou OC > set point, taper OC en F47",{"$nulls":5},{"v":161,"d":"161 m"},null,"OC ou"," rinçage  =",{"v":1.7955,"d":"1.80"},{"v":6.7545,"d":"6.75"},{"v":0.105,"d":"10.50%"},{"v":75.5,"d":"76 m"},{"v":87.32168435116284,"d":"87 m"},"hyperoxie","Narcose",{"v":7.602339181286549,"d":"7.60 "},{"v":92.39766081871345,"d":"92.398"},{"v":40.77885589205789,"d":"40.779 "},{"v":51.61880492665556,"d":"51.619 "},{"v":100,"d":"100 "}]
[17.2,"PP02 rinçage ou OC > set point, taper OC en F47",{"$nulls":5},{"v":162,"d":"162 m"},null,"OC ou"," rinçage  =",{"v":1.806,"d":"1.81"},{"v":6.794,"d":"6.79"},{"v":0.10500000000000001,"d":"10.50%"},{"v":76,"d":"76 m"},{"v":87.89081700818718,"d":"88 m"},"hyperoxie","Narcose",{"v":7.558139534883722,"d":"7.56 "},{"v":92.44186046511628,"d":"92.442"},{"v":40.79836299857087,"d":"40.798 "},{"v":51.643497466545405,"d":"51.643 "},{"v":100,"d":"100 "}]
[17.3,"PP02 rinçage ou OC > set point, taper OC en F47",{"$nulls":5},{"v":163,"d":"163 m"},null,"OC ou"," rinçage  =",{"v":1.8165,"d":"1.82"},{"v":6.8335,"d":"6.83"},{"v":0.105,"d":"10.50%"},{"v":76.49999999999999,"d":"77 m"},{"v":88.45994966521154,"d":"88 m"},"hyperoxie","Narcose",{"v":7.514450867052023,"d":"7.51 "},{"v":92.48554913294798,"d":"92.486"},{"v":40.817644589401624,"d":"40.818 "},{"v":51.667904543546356,"d":"51.668 "},{"v":100,"d":"100 "}]
[17.4,"PP02 rinçage ou OC > set point, taper OC en F47",{"$nulls":5},{"v":164,"d":"164 m"},null,"OC ou"," rinçage  =",{"v":1.827,"d":"1.83"},{"v":6.872999999999999,"d":"6.87"},{"v":0.10500000000000001,"d":"10.50%"},{"v":76.99999999999999,"d":"77 m"},{"v":89.02908232223587,"d":"89 m"},"hyperoxie","Narcose",{"v":7.471264367816093,"d":"7.47 "},{"v":92.52873563218391,"d":"92.529"},{"v":40.836704552751556,"d":"40.837 "},{"v":51.692031079432354,"d":"51.692 "},{"v":100,"d":"100 "}]
[17.5,"PP02 rinçage ou OC > set point, taper OC en F47",{"$nulls":5},{"v":165,"d":"165 m"},null,"OC ou"," rinçage  =",{"v":1.8375,"d":"1.84"},{"v":6.9125,"d":"6.91"},{"v":0.105,"d":"10.50%"},{"v":77.5,"d":"78 m"},{"v":89.59821497926022,"d":"90 m"},"hyperoxie","Narcose",{"v":7.428571428571429,"d":"7.43 "},{"v":92.57142857142857,"d":"92.571"},{"v":40.85554668794892,"d":"40.856 "},{"v":51.715881883479646,"d":"51.716 "},{"v":100,"d":"100 "}]
[17.6,"PP02 rinçage ou OC > set point, taper OC en F47",{"$nulls":5},{"v":166,"d":"166 m"},null,"OC ou"," rinçage  =",{"v":1.848,"d":"1.85"},{"v":6.952000000000001,"d":"6.95"},{"v":0.105,"d":"10.50%"},{"v":78.00000000000001,"d":"78 m"},{"v":90.16734763628456,"d":"90 m"},"hyperoxie","Narcose",{"v":7.386363636363635,"d":"7.39 "},{"v":92.61363636363636,"d":"92.614"},{"v":40.87417470797359,"d":"40.874 "},{"v":51.73946165566278,"d":"51.739 "},{"v":100.00000000000001,"d":"100 "}]
[17.7,"PP02 rinçage ou OC > set point, taper OC en F47",{"$nulls":5},{"v":167,"d":"167 m"},null,"OC ou"," rinçage  =",{"v":1.8585,"d":"1.86"},{"v":6.991499999999999,"d":"6.99"},{"v":0.10500000000000001,"d":"10.50%"},{"v":78.49999999999999,"d":"79 m"},{"v":90.7364802933089,"d":"91 m"},"hyperoxie","Narcose",{"v":7.344632768361582,"d":"7.34 "},{"v":92.65536723163842,"d":"92.655"},{"v":40.89259224189629,"d":"40.893 "},{"v":51.76277498974213,"d":"51.763 "},{"v":100,"d":"100 "}]
[17.8,"PP02 rinçage ou OC > set point, taper OC en F47",{"$nulls":5},{"v":168,"d":"168 m"},null,"OC ou"," rinçage  =",{"v":1.869,"d":"1.87"},{"v":7.031000000000001,"d":"7.03"},{"v":0.105,"d":"10.50%"},{"v":79,"d":"79 m"},{"v":91.30561295033324,"d":"91 m"},"hyperoxie","Narcose",{"v":7.303370786516854,"d":"7.30 "},{"v":92.69662921348315,"d":"92.697"},{"v":40.91080283723558,"d":"40.911 "},{"v":51.78582637624757,"d":"51.786 "},{"v":100,"d":"100 "}]
[17.9,"PP02 rinçage ou OC > set point, taper OC en F47",{"$nulls":5},{"v":169,"d":"169 m"},null,"OC ou"," rinçage  =",{"v":1.8795,"d":"1.88"},{"v":7.070499999999999,"d":"7.07"},{"v":0.10500000000000001,"d":"10.50%"},{"v":79.49999999999997,"d":"80 m"},{"v":91.87474560735758,"d":"92 m"},"hyperoxie","Narcose",{"v":7.262569832402235,"d":"7.26 "},{"v":92.73743016759776,"d":"92.737"},{"v":40.92880996223588,"d":"40.929 "},{"v":51.80862020536188,"d":"51.809 "},{"v":100,"d":"100 "}]
[18,"PP02 rinçage ou OC > set point, taper OC en F47",{"$nulls":5},{"v":170,"d":"170 m"},null,"OC ou"," rinçage  =",1.89,7.11,{"v":0.105,"d":"10.50%"},{"v":80,"d":"80 m"},{"v":92.44387826438192,"d":"92 m"},"hyperoxie","Narcose",{"v":7.222222222222223,"d":"7.22 "},{"v":92.77777777777777,"d":"92.778"},{"v":40.946617008069516,"d":"40.947 "},{"v":51.83116076970826,"d":"51.831 "},{"v":100,"d":"100 "}]
[18.1,{"$f":"IF(A221*$E$20/100>$Q$45,\"PP02 rinçage ou OC > set point, taper OC en F47\",\"\")","v":"PP02 rinçage ou OC > set point, taper OC en F47"},{"$nulls":5},{"v":171,"d":"171 m"},null,"OC ou",{"$f":"IF(J221=\"OC ou\",\" rinçage  =\",\"m\")","v":" rinçage  ="},{"$f":"IF($F$47=\"oc\",IF(A221*$E$20/100>$Q$45,A221*$E$20/100,$Q$45),$Q$45)","v":{"v":1.9005,"d":"1.90"}},{"v":7.149500000000001,"d":"7.15"},{"v":0.105,"d":"10.50%"},{"v":80.5,"d":"81 m"},{"v":93.01301092140628,"d":"93 m"},{"$f":"IF(O221>(A221*10)-10,\"Pne>P\",IF(L221>1.4,\"hyperoxie\",\"\"))","v":"hyperoxie"},"Narcose",{"$f":"$Q$45/A221*100","v":{"v":7.18232044198895,"d":"7.18 "}},{"v":92.81767955801105,"d":"92.818"},{"v":40.964227290965766,"d":"40.964 "},{"v":51.853452267045284,"d":"51.853 "},{"v":100,"d":"100 "}]
[18.2,{"$f":"IF(A222*$E$20/100>$Q$45,\"PP02 rinçage ou OC > set point, taper OC en F47\",\"\")","v":"PP02 rinçage ou OC > set point, taper OC en F47"},{"$nulls":5},{"v":172,"d":"172 m"},null,"OC ou",{"$f":"IF(J222=\"OC ou\",\" rinçage  =\",\"m\")","v":" rinçage  ="},{"v":1.911,"d":"1.91"},{"v":7.189,"d":"7.19"},{"v":0.10500000000000001,"d":"10.50%"},{"v":81,"d":"81 m"},{"v":93.58214357843062,"d":"94 m"},{"$f":"IF(O222>(A222*10)-10,\"Pne>P\",IF(L222>1.4,\"hyperoxie\",\"\"))","v":"hyperoxie"},"Narcose",{"v":7.142857142857144,"d":"7.14 "},{"v":92.85714285714286,"d":"92.857"},{"v":40.98164405426975,"d":"40.982 "},{"v":51.8754988028731,"d":"51.875 "},{"v":100,"d":"100 "}]
[18.3,"PP02 rinçage ou OC > set point, taper OC en F47",{"$nulls":5},{"v":173,"d":"173 m"},null,"OC ou"," rinçage  =",{"v":1.9215,"d":"1.92"},{"v":7.2285,"d":"7.23"},{"v":0.105,"d":"10.50%"},{"v":81.49999999999999,"d":"82 m"},{"v":94.15127623545499,"d":"94 m"},"hyperoxie","Narcose",{"v":7.103825136612022,"d":"7.10 "},{"v":92.89617486338798,"d":"92.896"},{"v":40.9988704704338,"d":"40.999 "},{"v":51.897304392954176,"d":"51.897 "},{"v":100,"d":"100 "}]
[18.4,"PP02 rinçage ou OC > set point, taper OC en F47",{"$nulls":5},{"v":174,"d":"174 m"},null,"OC ou"," rinçage  =",{"v":1.932,"d":"1.93"},{"v":7.268,"d":"7.27"},{"v":0.10500000000000001,"d":"10.50%"},{"v":81.99999999999999,"d":"82 m"},{"v":94.7204088924793,"d":"95 m"},"hyperoxie","Narcose",{"v":7.065217391304349,"d":"7.07 "},{"v":92.93478260869566,"d":"92.935"},{"v":41.01590964294389,"d":"41.016 "},{"v":51.91887296575176,"d":"51.919 "},{"v":100,"d":"100 "}]
[18.5,"PP02 rinçage ou OC > set point, taper OC en F47",{"$nulls":5},{"v":175,"d":"175 m"},null,"OC ou"," rinçage  =",{"v":1.9425,"d":"1.94"},{"v":7.3075,"d":"7.31"},{"v":0.105,"d":"10.50%"},{"v":82.5,"d":"83 m"},{"v":95.28954154950367,"d":"95 m"},"hyperoxie","Narcose",{"v":7.027027027027027,"d":"7.03 "},{"v":92.97297297297297,"d":"92.973"},{"v":41.0327646081836,"d":"41.033 "},{"v":51.94020836478938,"d":"51.940 "},{"v":100,"d":"100 "}]
[18.6,"PP02 rinçage ou OC > set point, taper OC en F47",{"$nulls":5},{"v":176,"d":"176 m"},null,"OC ou"," rinçage  =",{"v":1.953,"d":"1.95"},{"v":7.347,"d":"7.35"},{"v":0.105,"d":"10.50%"},{"v":83,"d":"83 m"},{"v":95.85867420652802,"d":"96 m"},"hyperoxie","Narcose",{"v":6.989247311827956,"d":"6.99 "},{"v":93.01075268817205,"d":"93.011"},{"v":41.049438337237945,"d":"41.049 "},{"v":51.9613143509341,"d":"51.961 "},{"v":100,"d":"100 "}]
[18.7,"PP02 rinçage ou OC > set point, taper OC en F47",{"$nulls":5},{"v":177,"d":"177 m"},null,"OC ou"," rinçage  =",{"v":1.9635,"d":"1.96"},{"v":7.3865,"d":"7.39"},{"v":0.10500000000000001,"d":"10.50%"},{"v":83.49999999999999,"d":"84 m"},{"v":96.42780686355235,"d":"96 m"},"hyperoxie","Narcose",{"v":6.951871657754011,"d":"6.95 "},{"v":93.04812834224599,"d":"93.048"},{"v":41.06593373763929,"d":"41.066 "},{"v":51.9821946046067,"d":"51.982 "},{"v":100,"d":"100 "}]
[18.8,"PP02 rinçage ou OC > set point, taper OC en F47",{"$nulls":5},{"v":178,"d":"178 m"},null,"OC ou"," rinçage  =",{"v":1.974,"d":"1.97"},{"v":7.426,"d":"7.43"},{"v":0.105,"d":"10.50%"},{"v":84,"d":"84 m"},{"v":96.99693952057669,"d":"97 m"},"hyperoxie","Narcose",{"v":6.914893617021277,"d":"6.91 "},{"v":93.08510638297872,"d":"93.085"},{"v":41.08225365505765,"d":"41.082 "},{"v":52.00285272792107,"d":"52.003 "},{"v":100,"d":"100 "}]
[18.9,"PP02 rinçage ou OC > set point, taper OC en F47",{"$nulls":5},{"v":179,"d":"179 m"},null,"OC ou"," rinçage  =",{"v":1.9845,"d":"1.98"},{"v":7.4655,"d":"7.47"},{"v":0.10500000000000001,"d":"10.50%"},{"v":84.5,"d":"85 m"},{"v":97.56607217760103,"d":"98 m"},"hyperoxie","Narcose",{"v":6.878306878306879,"d":"6.88 "},{"v":93.12169312169313,"d":"93.122"},{"v":41.09840087493719,"d":"41.098 "},{"v":52.02329224675593,"d":"52.023 "},{"v":99.99999999999999,"d":"100 "}]
[19,"PP02 rinçage ou OC > set point, taper OC en F47",{"$nulls":5},{"v":180,"d":"180 m"},null,"OC ou"," rinçage  =",{"v":1.995,"d":"2.00"},{"v":7.505,"d":"7.51"},{"v":0.10500000000000001,"d":"10.50%"},{"v":84.99999999999999,"d":"85 m"},{"v":98.13520483462537,"d":"98 m"},"hyperoxie","Narcose",{"v":6.842105263157896,"d":"6.84 "},{"v":93.15789473684211,"d":"93.158"},{"v":41.114378124081156,"d":"41.114 "},{"v":52.043516612760946,"d":"52.044 "},{"v":100,"d":"100 "}]
[19.1,"PP02 rinçage ou OC > set point, taper OC en F47",{"$nulls":5},{"v":181,"d":"181 m"},null,"OC ou"," rinçage  =",{"v":2.0055,"d":"2.01"},{"v":7.5445,"d":"7.54"},{"v":0.105,"d":"10.50%"},{"v":85.5,"d":"86 m"},{"v":98.70433749164972,"d":"99 m"},"hyperoxie","Narcose",{"v":6.806282722513089,"d":"6.81 "},{"v":93.19371727748691,"d":"93.194"},{"v":41.13018807218696,"d":"41.130 "},{"v":52.06352920529995,"d":"52.064 "},{"v":100,"d":"100 "}]
[19.2,"PP02 rinçage ou OC > set point, taper OC en F47",{"$nulls":5},{"v":182,"d":"182 m"},null,"OC ou"," rinçage  =",{"v":2.016,"d":"2.02"},{"v":7.584,"d":"7.58"},{"v":0.10500000000000001,"d":"10.50%"},{"v":86,"d":"86 m"},{"v":99.27347014867406,"d":"99 m"},"hyperoxie","Narcose",{"v":6.770833333333334,"d":"6.77 "},{"v":93.22916666666667,"d":"93.229"},{"v":41.145833333333336,"d":"41.146 "},{"v":52.08333333333333,"d":"52.083 "},{"v":99.99999999999999,"d":"100 "}]
[19.3,"PP02 rinçage ou OC > set point, taper OC en F47",{"$nulls":5},{"v":183,"d":"183 m"},null,"OC ou"," rinçage  =",{"v":2.0265,"d":"2.03"},{"v":7.6235,"d":"7.62"},{"v":0.105,"d":"10.50%"},{"v":86.5,"d":"87 m"},{"v":99.84260280569842,"d":"100 m"},"hyperoxie","Narcose",{"v":6.7357512953367875,"d":"6.74 "},{"v":93.26424870466322,"d":"93.264"},{"v":41.161316467421194,"d":"41.161 "},{"v":52.102932237242015,"d":"52.103 "},{"v":99.99999999999999,"d":"100 "}]
[19.4,"PP02 rinçage ou OC > set point, taper OC en F47",{"$nulls":5},{"v":184,"d":"184 m"},null,"OC ou"," rinçage  =",{"v":2.037,"d":"2.04"},{"v":7.662999999999999,"d":"7.66"},{"v":0.10500000000000001,"d":"10.50%"},{"v":86.99999999999999,"d":"87 m"},{"v":100.41173546272275,"d":"100 m"},"hyperoxie","Narcose",{"v":6.701030927835053,"d":"6.70 "},{"v":93.29896907216495,"d":"93.299"},{"v":41.176639981570005,"d":"41.177 "},{"v":52.122329090594945,"d":"52.122 "},{"v":100,"d":"100 "}]
[19.5,"PP02 rinçage ou OC > set point, taper OC en F47",{"$nulls":5},{"v":185,"d":"185 m"},null,"OC ou"," rinçage  =",{"v":2.0475,"d":"2.05"},{"v":7.7025,"d":"7.70"},{"v":0.105,"d":"10.50%"},{"v":87.49999999999999,"d":"88 m"},{"v":100.9808681197471,"d":"101 m"},"hyperoxie","Narcose",{"v":6.666666666666667,"d":"6.67 "},{"v":93.33333333333333,"d":"93.333"},{"v":41.191806331471135,"d":"41.192 "},{"v":52.1415270018622,"d":"52.142 "},{"v":100.00000000000001,"d":"100 "}]
[19.6,"PP02 rinçage ou OC > set point, taper OC en F47",{"$nulls":5},{"v":186,"d":"186 m"},null,"OC ou"," rinçage  =",{"v":2.0580000000000003,"d":"2.06"},{"v":7.742000000000001,"d":"7.74"},{"v":0.10500000000000001,"d":"10.50%"},{"v":88.00000000000001,"d":"88 m"},{"v":101.55000077677145,"d":"102 m"},"hyperoxie","Narcose",{"v":6.63265306122449,"d":"6.63 "},{"v":93.36734693877551,"d":"93.367"},{"v":41.206817922699805,"d":"41.207 "},{"v":52.16052901607571,"d":"52.161 "},{"v":100,"d":"100 "}]
[19.7,"PP02 rinçage ou OC > set point, taper OC en F47",{"$nulls":5},{"v":187,"d":"187 m"},null,"OC ou"," rinçage  =",{"v":2.0685,"d":"2.07"},{"v":7.781499999999999,"d":"7.78"},{"v":0.105,"d":"10.50%"},{"v":88.49999999999999,"d":"89 m"},{"v":102.11913343379578,"d":"102 m"},"hyperoxie","Narcose",{"v":6.598984771573605,"d":"6.60 "},{"v":93.40101522842639,"d":"93.401"},{"v":41.22167711198706,"d":"41.222 "},{"v":52.17933811643933,"d":"52.179 "},{"v":100,"d":"100 "}]
[19.8,"PP02 rinçage ou OC > set point, taper OC en F47",{"$nulls":5},{"v":188,"d":"188 m"},null,"OC ou"," rinçage  =",{"v":2.079,"d":"2.08"},{"v":7.821000000000001,"d":"7.82"},{"v":0.10500000000000001,"d":"10.50%"},{"v":89,"d":"89 m"},{"v":102.68826609082014,"d":"103 m"},"hyperoxie","Narcose",{"v":6.565656565656567,"d":"6.57 "},{"v":93.43434343434343,"d":"93.434"},{"v":41.23638620845325,"d":"41.236 "},{"v":52.197957225890185,"d":"52.198 "},{"v":100,"d":"100 "}]
[19.9,"PP02 rinçage ou OC > set point, taper OC en F47",{"$nulls":5},{"v":189,"d":"189 m"},null,"OC ou"," rinçage  =",{"v":2.0894999999999997,"d":"2.09"},{"v":7.860499999999999,"d":"7.86"},{"v":0.105,"d":"10.50%"},{"v":89.49999999999999,"d":"90 m"},{"v":103.25739874784446,"d":"103 m"},"hyperoxie","Narcose",{"v":6.532663316582915,"d":"6.53 "},{"v":93.46733668341709,"d":"93.467"},{"v":41.250947474804185,"d":"41.251 "},{"v":52.2163892086129,"d":"52.216 "},{"v":100,"d":"100 "}]
[20,"PP02 rinçage ou OC > set point, taper OC en F47",{"$nulls":5},{"v":190,"d":"190 m"},null,"OC ou"," rinçage  =",{"v":2.1,"d":"2.10"},{"v":7.9,"d":"7.90"},{"v":0.10500000000000001,"d":"10.50%"},{"v":90,"d":"90 m"},{"v":103.8265314048688,"d":"104 m"},"hyperoxie","Narcose",{"v":6.5,"d":"6.50 "},{"v":93.5,"d":"93.500"},{"v":41.26536312849162,"d":"41.265 "},{"v":52.23463687150838,"d":"52.235 "},{"v":100,"d":"100 "}]
[20.1,"PP02 rinçage ou OC > set point, taper OC en F47",{"$nulls":5},{"v":191,"d":"191 m"},null,"OC ou"," rinçage  =",{"v":2.1105,"d":"2.11"},{"v":7.939500000000001,"d":"7.94"},{"v":0.105,"d":"10.50%"},{"v":90.50000000000001,"d":"91 m"},{"v":104.39566406189316,"d":"104 m"},"hyperoxie","Narcose",{"v":6.467661691542288,"d":"6.47 "},{"v":93.53233830845771,"d":"93.532"},{"v":41.27963534283887,"d":"41.280 "},{"v":52.25270296561884,"d":"52.253 "},{"v":100,"d":"100 "}]
[20.2,"PP02 rinçage ou OC > set point, taper OC en F47",{"$nulls":5},{"v":192,"d":"192 m"},null,"OC ou"," rinçage  =",{"v":2.121,"d":"2.12"},{"v":7.979,"d":"7.98"},{"v":0.10500000000000001,"d":"10.50%"},{"v":91,"d":"91 m"},{"v":104.9647967189175,"d":"105 m"},"hyperoxie","Narcose",{"v":6.435643564356436,"d":"6.44 "},{"v":93.56435643564356,"d":"93.564"},{"v":41.29376624813319,"d":"41.294 "},{"v":52.27059018751038,"d":"52.271 "},{"v":100,"d":"100 "}]
[20.3,"PP02 rinçage ou OC > set point, taper OC en F47",{"$nulls":5},{"v":193,"d":"193 m"},null,"OC ou"," rinçage  =",{"v":2.1315,"d":"2.13"},{"v":8.0185,"d":"8.02"},{"v":0.105,"d":"10.50%"},{"v":91.5,"d":"92 m"},{"v":105.53392937594184,"d":"106 m"},"hyperoxie","Narcose",{"v":6.403940886699508,"d":"6.40 "},{"v":93.5960591133005,"d":"93.596"},{"v":41.307757932685696,"d":"41.308 "},{"$f":"100-(S243+U243)","v":{"v":52.288301180614795,"d":"52.288 "}},{"$f":"V243+U243+S243","v":{"v":100,"d":"100 "}}]
[20.4,"PP02 rinçage ou OC > set point, taper OC en F47",{"$nulls":5},{"v":194,"d":"194 m"},null,"OC ou"," rinçage  =",{"v":2.142,"d":"2.14"},{"v":8.058,"d":"8.06"},{"v":0.105,"d":"10.50%"},{"v":92,"d":"92 m"},{"$f":"IF(J244=\"OC ou\",(((((($E$20%*1.428)+($F$20%*0.178)+($D$23%*1.25))*A244))/1.28738)*10)-10,((((((S244%*1.428)+(V244%*0.178)+(U244%*1.25))*A244))/1.28738)*10)-10)","v":{"v":106.10306203296618,"d":"106 m"}},"hyperoxie","Narcose",{"v":6.3725490196078445,"d":"6.37 "},{"v":93.62745098039215,"d":"93.627"},{"v":41.321612443860225,"d":"41.322 "},{"v":52.30583853653193,"d":"52.306 "},{"v":100,"d":"100 "}]
[20.5,"PP02 rinçage ou OC > set point, taper OC en F47",{"$nulls":5},{"v":195,"d":"195 m"},null,"OC ou"," rinçage  =",{"v":2.1525,"d":"2.15"},{"v":8.0975,"d":"8.10"},{"v":0.105,"d":"10.50%"},{"v":92.49999999999999,"d":"93 m"},{"v":106.67219468999053,"d":"107 m"},"hyperoxie","Narcose",{"v":6.341463414634147,"d":"6.34 "},{"v":93.65853658536585,"d":"93.659"},{"v":41.33533178907208,"d":"41.335 "},{"v":52.32320479629377,"d":"52.323 "},{"v":100,"d":"100 "}]
[20.6,"PP02 rinçage ou OC > set point, taper OC en F47",{"$nulls":5},{"v":196,"d":"196 m"},null,"OC ou"," rinçage  =",{"v":2.1630000000000003,"d":"2.16"},{"v":8.137,"d":"8.14"},{"v":0.10500000000000001,"d":"10.50%"},{"v":93,"d":"93 m"},{"v":107.2413273470149,"d":"107 m"},"hyperoxie","Narcose",{"v":6.310679611650485,"d":"6.31 "},{"v":93.68932038834951,"d":"93.689"},{"v":41.34891793675761,"d":"41.349 "},{"v":52.340402451591906,"d":"52.340 "},{"v":100,"d":"100 "}]
[20.7,"PP02 rinçage ou OC > set point, taper OC en F47",{"$nulls":5},{"v":197,"d":"197 m"},null,"OC ou"," rinçage  =",{"v":2.1734999999999998,"d":"2.17"},{"v":8.176499999999999,"d":"8.18"},{"v":0.105,"d":"10.50%"},{"v":93.49999999999997,"d":"94 m"},{"v":107.81046000403921,"d":"108 m"},"hyperoxie","Narcose",{"v":6.280193236714976,"d":"6.28 "},{"v":93.71980676328502,"d":"93.720"},{"v":41.36237281731574,"d":"41.362 "},{"v":52.357433945969284,"d":"52.357 "},{"v":100,"d":"100 "}]
[20.8,"PP02 rinçage ou OC > set point, taper OC en F47",{"$nulls":5},{"v":198,"d":"198 m"},null,"OC ou"," rinçage  =",{"v":2.184,"d":"2.18"},{"v":8.216000000000001,"d":"8.22"},{"v":0.10500000000000001,"d":"10.50%"},{"v":94.00000000000001,"d":"94 m"},{"v":108.37959266106358,"d":"108 m"},"hyperoxie","Narcose",{"v":6.25,"d":"6.25 "},{"v":93.75,"d":"93.750"},{"v":41.375698324022345,"d":"41.376 "},{"v":52.374301675977655,"d":"52.374 "},{"v":100,"d":"100 "}]
[20.9,"PP02 rinçage ou OC > set point, taper OC en F47",{"$nulls":5},{"v":199,"d":"199 m"},null,{"$f":"IF($F$47=\"oc\",IF($E$20>S249,\"OC ou\",(A249-1)*10),(A249-1)*10)","v":"OC ou"}," rinçage  =",{"v":2.1944999999999997,"d":"2.19"},{"v":8.2555,"d":"8.26"},{"v":0.105,"d":"10.50%"},{"v":94.49999999999999,"d":"95 m"},{"v":108.9487253180879,"d":"109 m"},"hyperoxie","Narcose",{"v":6.220095693779905,"d":"6.22 "},{"$f":"100-S249","v":{"v":93.77990430622009,"d":"93.780"}},{"$f":"T249/($T$47+1)","v":{"v":41.38889631391836,"d":"41.389 "}},{"v":52.39100799230174,"d":"52.391 "},{"v":100,"d":"100 "}]
[21,"PP02 rinçage ou OC > set point, taper OC en F47",{"$nulls":5},{"v":200,"d":"200 m"},null,"OC ou"," rinçage  =",{"v":2.205,"d":"2.21"},{"$f":"IF($R$47=0,0,IF(K250=\"m\",U250*A250/100,$R$47*A250/100))","v":{"v":8.295,"d":"8.30"}},{"$f":"IF(K250=\"m\",S250/100,L250/A250)","v":{"v":0.10500000000000001,"d":"10.50%"}},{"v":95,"d":"95 m"},{"v":109.51785797511226,"d":"110 m"},"hyperoxie",{"$f":"IF(M250>5.53,\"Narcose\",IF(M250>3.56,\"Pne>à35m\",\"\"))","v":"Narcose"},{"v":6.190476190476191,"d":"6.19 "},{"v":93.80952380952381,"d":"93.810"},{"v":41.40196860867252,"d":"41.402 "},{"v":52.40755520085129,"d":"52.408 "},{"v":100,"d":"100 "}]
[21.1,"PP02 rinçage ou OC > set point, taper OC en F47",{"$nulls":5},{"v":201,"d":"201 m"},null,"OC ou"," rinçage  =",{"v":2.2155,"d":"2.22"},{"v":8.3345,"d":"8.33"},{"v":0.105,"d":"10.50%"},{"v":95.5,"d":"96 m"},{"v":110.0869906321366,"d":"110 m"},"hyperoxie","Narcose",{"v":6.161137440758294,"d":"6.16 "},{"v":93.8388625592417,"d":"93.839"},{"v":41.414916995419524,"d":"41.415 "},{"v":52.42394556382218,"d":"52.424 "},{"v":100,"d":"100 "}]
[21.2,"PP02 rinçage ou OC > set point, taper OC en F47",{"$nulls":5},{"v":202,"d":"202 m"},null,"OC ou"," rinçage  =",{"v":2.226,"d":"2.23"},{"v":8.374,"d":"8.37"},{"v":0.105,"d":"10.50%"},{"v":96,"d":"96 m"},{"v":110.65612328916094,"d":"111 m"},"hyperoxie","Narcose",{"v":6.132075471698114,"d":"6.13 "},{"v":93.86792452830188,"d":"93.868"},{"v":41.427743227574574,"d":"41.428 "},{"v":52.44018130072731,"d":"52.440 "},{"v":100,"d":"100 "}]
[21.3,"PP02 rinçage ou OC > set point, taper OC en F47",{"$nulls":5},{"v":203,"d":"203 m"},null,"OC ou"," rinçage  =",{"$f":"IF($F$47=\"oc\",IF(A253*$E$20/100>$Q$45,A253*$E$20/100,$Q$45),$Q$45)","v":{"v":2.2365,"d":"2.24"}},{"v":8.4135,"d":"8.41"},{"v":0.105,"d":"10.50%"},{"v":96.5,"d":"97 m"},{"v":111.22525594618529,"d":"111 m"},"hyperoxie","Narcose",{"v":6.103286384976526,"d":"6.10 "},{"v":93.89671361502347,"d":"93.897"},{"v":41.440449025624886,"d":"41.440 "},{"v":52.456264589398586,"d":"52.456 "},{"v":100,"d":"100 "}]
[21.4,"PP02 rinçage ou OC > set point, taper OC en F47",{"$nulls":5},{"v":204,"d":"204 m"},null,"OC ou"," rinçage  =",{"v":2.247,"d":"2.25"},{"v":8.453,"d":"8.45"},{"v":0.105,"d":"10.50%"},{"$f":"IF(M254=\"\",\"\",IF(M254<0,\"!\",IF(M254<0.79,0,(10*M254)/0.79-7.9/0.79)))","v":{"v":97,"d":"97 m"}},{"v":111.79438860320963,"d":"112 m"},"hyperoxie","Narcose",{"v":6.074766355140188,"d":"6.07 "},{"v":93.92523364485982,"d":"93.925"},{"v":41.45303607789902,"d":"41.453 "},{"v":52.47219756696079,"d":"52.472 "},{"v":100,"d":"100 "}]
[21.5,"PP02 rinçage ou OC > set point, taper OC en F47",{"$nulls":5},{"v":205,"d":"205 m"},null,"OC ou"," rinçage  =",{"v":2.2575,"d":"2.26"},{"v":8.4925,"d":"8.49"},{"v":0.105,"d":"10.50%"},{"v":97.49999999999999,"d":"98 m"},{"v":112.36352126023398,"d":"112 m"},"hyperoxie","Narcose",{"v":6.046511627906977,"d":"6.05 "},{"v":93.95348837209302,"d":"93.953"},{"v":41.4655060413148,"d":"41.466 "},{"v":52.48798233077822,"d":"52.488 "},{"v":100,"d":"100 "}]
[21.6,"PP02 rinçage ou OC > set point, taper OC en F47",{"$nulls":5},{"v":206,"d":"206 m"},null,"OC ou"," rinçage  =",{"v":2.2680000000000002,"d":"2.27"},{"v":8.532,"d":"8.53"},{"v":0.10500000000000001,"d":"10.50%"},{"v":97.99999999999999,"d":"98 m"},{"v":112.93265391725834,"d":"113 m"},"hyperoxie","Narcose",{"v":6.018518518518518,"d":"6.02 "},{"v":93.98148148148148,"d":"93.981"},{"v":41.47786054210635,"d":"41.478 "},{"v":52.50362093937513,"d":"52.504 "},{"v":100,"d":"100 "}]
[21.7,"PP02 rinçage ou OC > set point, taper OC en F47",{"$nulls":5},{"v":207,"d":"207 m"},null,"OC ou"," rinçage  =",{"v":2.2784999999999997,"d":"2.28"},{"v":8.5715,"d":"8.57"},{"v":0.105,"d":"10.50%"},{"v":98.5,"d":"99 m"},{"v":113.50178657428266,"d":"114 m"},"hyperoxie","Narcose",{"v":5.990783410138249,"d":"5.99 "},{"v":94.00921658986175,"d":"94.009"},{"v":41.49010117653116,"d":"41.490 "},{"v":52.51911541333059,"d":"52.519 "},{"v":100,"d":"100 "}]
[21.8,"PP02 rinçage ou OC > set point, taper OC en F47",{"$nulls":5},{"v":208,"d":"208 m"},null,"OC ou"," rinçage  =",{"v":2.289,"d":"2.29"},{"v":8.611,"d":"8.61"},{"v":0.10500000000000001,"d":"10.50%"},{"v":99.00000000000001,"d":"99 m"},{"v":114.07091923130702,"d":"114 m"},"hyperoxie","Narcose",{"v":5.963302752293578,"d":"5.96 "},{"v":94.03669724770643,"d":"94.037"},{"v":41.50222951155759,"d":"41.502 "},{"v":52.534467736148834,"d":"52.534 "},{"v":100,"d":"100 "}]
[21.9,"PP02 rinçage ou OC > set point, taper OC en F47",{"$nulls":5},{"v":209,"d":"209 m"},null,"OC ou"," rinçage  =",{"v":2.2995,"d":"2.30"},{"v":8.6505,"d":"8.65"},{"v":0.10500000000000001,"d":"10.50%"},{"v":99.49999999999999,"d":"100 m"},{"v":114.64005188833134,"d":"115 m"},"hyperoxie","Narcose",{"v":5.936073059360731,"d":"5.94 "},{"v":94.06392694063926,"d":"94.064"},{"v":41.514247085533526,"d":"41.514 "},{"v":52.549679855105744,"d":"52.550 "},{"v":100.00000000000001,"d":"100 "}]
[22,"PP02 rinçage ou OC > set point, taper OC en F47",{"$nulls":5},{"v":210,"d":"210 m"},null,"OC ou"," rinçage  =",2.31,8.69,{"v":0.105,"d":"10.50%"},{"v":99.99999999999999,"d":"100 m"},{"v":115.20918454535568,"d":"115 m"},"hyperoxie","Narcose",{"v":5.909090909090909,"d":"5.91 "},{"v":94.0909090909091,"d":"94.091"},{"v":41.52615540883697,"d":"41.526 "},{"v":52.56475368207212,"d":"52.565 "},{"v":100,"d":"100 "}]
[22.1,"PP02 rinçage ou OC > set point, taper OC en F47",{"$nulls":5},{"v":211,"d":"211 m"},null,"OC ou"," rinçage  =",{"v":2.3205,"d":"2.32"},{"v":8.7295,"d":"8.73"},{"v":0.105,"d":"10.50%"},{"v":100.5,"d":"101 m"},{"v":115.77831720238007,"d":"116 m"},"hyperoxie","Narcose",{"v":5.88235294117647,"d":"5.88 "},{"v":94.11764705882354,"d":"94.118"},{"v":41.53795596450871,"d":"41.538 "},{"v":52.57969109431482,"d":"52.580 "},{"v":100,"d":"100 "}]
[22.2,"PP02 rinçage ou OC > set point, taper OC en F47",{"$nulls":5},{"v":212,"d":"212 m"},null,"OC ou"," rinçage  =",{"v":2.331,"d":"2.33"},{"v":8.769,"d":"8.77"},{"v":0.105,"d":"10.50%"},{"v":100.99999999999999,"d":"101 m"},{"v":116.34744985940436,"d":"116 m"},"hyperoxie","Narcose",{"v":5.855855855855856,"d":"5.86 "},{"v":94.14414414414415,"d":"94.144"},{"v":41.54965020886809,"d":"41.550 "},{"v":52.594493935276056,"d":"52.594 "},{"v":100,"d":"100 "}]
[22.3,"PP02 rinçage ou OC > set point, taper OC en F47",{"$nulls":5},{"v":213,"d":"213 m"},null,"OC ou"," rinçage  =",{"v":2.3415,"d":"2.34"},{"v":8.8085,"d":"8.81"},{"v":0.105,"d":"10.50%"},{"v":101.5,"d":"102 m"},{"v":116.91658251642875,"d":"117 m"},"hyperoxie","Narcose",{"v":5.829596412556054,"d":"5.83 "},{"v":94.17040358744394,"d":"94.170"},{"v":41.56123957211213,"d":"41.561 "},{"v":52.609164015331814,"d":"52.609 "},{"v":100,"d":"100 "}]
[22.4,"PP02 rinçage ou OC > set point, taper OC en F47",{"$nulls":5},{"v":214,"d":"214 m"},null,"OC ou"," rinçage  =",{"v":2.352,"d":"2.35"},{"v":8.847999999999999,"d":"8.85"},{"v":0.105,"d":"10.50%"},{"v":101.99999999999999,"d":"102 m"},{"v":117.48571517345306,"d":"117 m"},"hyperoxie","Narcose",{"v":5.80357142857143,"d":"5.80 "},{"v":94.19642857142857,"d":"94.196"},{"v":41.57272545889864,"d":"41.573 "},{"v":52.62370311252993,"d":"52.624 "},{"v":100,"d":"100 "}]
[22.5,"PP02 rinçage ou OC > set point, taper OC en F47",{"$nulls":5},{"v":215,"d":"215 m"},null,"OC ou"," rinçage  =",{"v":2.3625,"d":"2.36"},{"v":8.8875,"d":"8.89"},{"v":0.105,"d":"10.50%"},{"v":102.5,"d":"103 m"},{"v":118.05484783047743,"d":"118 m"},"hyperoxie","Narcose",{"v":5.777777777777779,"d":"5.78 "},{"v":94.22222222222223,"d":"94.222"},{"v":41.58410924891372,"d":"41.584 "},{"v":52.6381129733085,"d":"52.638 "},{"v":100,"d":"100 "}]
[22.6,"PP02 rinçage ou OC > set point, taper OC en F47",{"$nulls":5},{"v":216,"d":"216 m"},null,"OC ou"," rinçage  =",{"v":2.373,"d":"2.37"},{"v":8.927,"d":"8.93"},{"v":0.10500000000000001,"d":"10.50%"},{"v":102.99999999999999,"d":"103 m"},{"v":118.62398048750177,"d":"119 m"},"hyperoxie","Narcose",{"v":5.752212389380531,"d":"5.75 "},{"v":94.24778761061947,"d":"94.248"},{"v":41.59539229742423,"d":"41.595 "},{"v":52.652395313195235,"d":"52.652 "},{"v":100,"d":"100 "}]
[22.7,"PP02 rinçage ou OC > set point, taper OC en F47",{"$nulls":5},{"v":217,"d":"217 m"},null,"OC ou"," rinçage  =",{"v":2.3834999999999997,"d":"2.38"},{"v":8.9665,"d":"8.97"},{"v":0.105,"d":"10.50%"},{"v":103.49999999999999,"d":"104 m"},{"v":119.19311314452611,"d":"119 m"},"hyperoxie","Narcose",{"v":5.726872246696035,"d":"5.73 "},{"v":94.27312775330397,"d":"94.273"},{"v":41.60657593581571,"d":"41.607 "},{"v":52.666551817488255,"d":"52.667 "},{"v":100,"d":"100 "}]
[22.8,"PP02 rinçage ou OC > set point, taper OC en F47",{"$nulls":5},{"v":218,"d":"218 m"},null,"OC ou"," rinçage  =",{"v":2.394,"d":"2.39"},{"v":9.006,"d":"9.01"},{"v":0.105,"d":"10.50%"},{"v":104,"d":"104 m"},{"v":119.76224580155045,"d":"120 m"},"hyperoxie","Narcose",{"v":5.701754385964912,"d":"5.70 "},{"v":94.29824561403508,"d":"94.298"},{"v":41.61766147211604,"d":"41.618 "},{"v":52.68058414191905,"d":"52.681 "},{"v":100.00000000000001,"d":"100 "}]
[22.9,"PP02 rinçage ou OC > set point, taper OC en F47",{"$nulls":5},{"v":219,"d":"219 m"},null,"OC ou"," rinçage  =",{"v":2.4045,"d":"2.40"},{"v":9.045499999999999,"d":"9.05"},{"v":0.10500000000000001,"d":"10.50%"},{"v":104.49999999999997,"d":"105 m"},{"v":120.33137845857479,"d":"120 m"},"hyperoxie","Narcose",{"v":5.676855895196507,"d":"5.68 "},{"v":94.32314410480349,"d":"94.323"},{"v":41.62865019150545,"d":"41.629 "},{"v":52.69449391329805,"d":"52.694 "},{"v":100.00000000000001,"d":"100 "}]
[23,"PP02 rinçage ou OC > set point, taper OC en F47",{"$nulls":5},{"v":220,"d":"220 m"},null,"OC ou"," rinçage  =",{"v":2.415,"d":"2.42"},{"v":9.085,"d":"9.09"},{"v":0.105,"d":"10.50%"},{"v":105,"d":"105 m"},{"v":120.90051111559913,"d":"121 m"},"hyperoxie","Narcose",{"v":5.6521739130434785,"d":"5.65 "},{"v":94.34782608695652,"d":"94.348"},{"v":41.639543356813206,"d":"41.640 "},{"v":52.70828273014332,"d":"52.708 "},{"v":100.00000000000001,"d":"100 "}]
[23.1,"PP02 rinçage ou OC > set point, taper OC en F47",{"$nulls":5},{"v":221,"d":"221 m"},null,"OC ou"," rinçage  =",{"v":2.4255,"d":"2.43"},{"v":9.124500000000001,"d":"9.12"},{"v":0.105,"d":"10.50%"},{"v":105.5,"d":"106 m"},{"v":121.46964377262347,"d":"121 m"},"hyperoxie","Narcose",{"v":5.627705627705628,"d":"5.63 "},{"v":94.37229437229438,"d":"94.372"},{"v":41.65034220900143,"d":"41.650 "},{"v":52.72195216329294,"d":"52.722 "},{"v":99.99999999999999,"d":"100 "}]
[23.2,"PP02 rinçage ou OC > set point, taper OC en F47",{"$nulls":5},{"v":222,"d":"222 m"},null,"OC ou"," rinçage  =",{"v":2.436,"d":"2.44"},{"v":9.164,"d":"9.16"},{"v":0.105,"d":"10.50%"},{"v":106,"d":"106 m"},{"v":122.03877642964781,"d":"122 m"},"hyperoxie","Narcose",{"v":5.603448275862069,"d":"5.60 "},{"v":94.39655172413794,"d":"94.397"},{"v":41.66104796763629,"d":"41.661 "},{"v":52.735503756501636,"d":"52.736 "},{"v":100,"d":"100 "}]
[23.3,"PP02 rinçage ou OC > set point, taper OC en F47",{"$nulls":5},{"v":223,"d":"223 m"},null,"OC ou"," rinçage  =",{"v":2.4465,"d":"2.45"},{"v":9.2035,"d":"9.20"},{"v":0.105,"d":"10.50%"},{"v":106.49999999999999,"d":"107 m"},{"v":122.60790908667215,"d":"123 m"},"hyperoxie","Narcose",{"v":5.579399141630901,"d":"5.58 "},{"v":94.4206008583691,"d":"94.421"},{"v":41.67166183134725,"d":"41.672 "},{"v":52.74893902702185,"d":"52.749 "},{"v":100,"d":"100 "}]
[23.4,"PP02 rinçage ou OC > set point, taper OC en F47",{"$nulls":5},{"v":224,"d":"224 m"},null,"OC ou"," rinçage  =",{"v":2.457,"d":"2.46"},{"v":9.243,"d":"9.24"},{"v":0.105,"d":"10.50%"},{"v":107,"d":"107 m"},{"v":123.17704174369649,"d":"123 m"},"hyperoxie","Narcose",{"v":5.555555555555556,"d":"5.56 "},{"v":94.44444444444444,"d":"94.444"},{"v":41.682184978274364,"d":"41.682 "},{"v":52.76225946617008,"d":"52.762 "},{"v":100,"d":"100 "}]
[23.5,"PP02 rinçage ou OC > set point, taper OC en F47",{"$nulls":5},{"v":225,"d":"225 m"},null,"OC ou"," rinçage  =",{"v":2.4675,"d":"2.47"},{"v":9.2825,"d":"9.28"},{"v":0.105,"d":"10.50%"},{"v":107.5,"d":"108 m"},{"v":123.74617440072086,"d":"124 m"},"hyperoxie","Narcose",{"v":5.531914893617022,"d":"5.53 "},{"v":94.46808510638297,"d":"94.468"},{"v":41.692618566504215,"d":"41.693 "},{"v":52.775466539878764,"d":"52.775 "},{"v":100,"d":"100 "}]
[23.5999999999999,"PP02 rinçage ou OC > set point, taper OC en F47",{"$nulls":5},{"v":226,"d":"226 m"},null,"OC ou"," rinçage  =",{"v":2.477999999999989,"d":"2.48"},{"v":9.32199999999996,"d":"9.32"},{"v":0.105,"d":"10.50%"},{"v":107.99999999999949,"d":"108 m"},{"v":124.3153070577446,"d":"124 m"},"hyperoxie","Narcose",{"v":5.508474576271211,"d":"5.51 "},{"v":94.49152542372879,"d":"94.492"},{"v":41.70296373449483,"d":"41.703 "},{"v":52.78856168923396,"d":"52.789 "},{"v":100,"d":"100 "}]
[23.6999999999999,"PP02 rinçage ou OC > set point, taper OC en F47",{"$nulls":5},{"v":227,"d":"227 m"},null,"OC ou"," rinçage  =",{"v":2.4884999999999895,"d":"2.49"},{"v":9.36149999999996,"d":"9.36"},{"v":0.105,"d":"10.50%"},{"v":108.4999999999995,"d":"109 m"},{"v":124.884439714769,"d":"125 m"},"hyperoxie","Narcose",{"v":5.485232067510572,"d":"5.49 "},{"v":94.51476793248943,"d":"94.515"},{"v":41.71322160148975,"d":"41.713 "},{"v":52.80154633099968,"d":"52.802 "},{"v":100,"d":"100 "}]
[23.7999999999999,"PP02 rinçage ou OC > set point, taper OC en F47",{"$nulls":5},{"v":228,"d":"228 m"},null,"OC ou"," rinçage  =",{"v":2.4989999999999895,"d":"2.50"},{"v":9.40099999999996,"d":"9.40"},{"v":0.105,"d":"10.50%"},{"v":108.9999999999995,"d":"109 m"},{"v":125.45357237179334,"d":"125 m"},"hyperoxie","Narcose",{"v":5.462184873949603,"d":"5.46 "},{"v":94.53781512605039,"d":"94.538"},{"v":41.72339326792168,"d":"41.723 "},{"v":52.81442185812872,"d":"52.814 "},{"v":100,"d":"100 "}]
[23.8999999999999,"PP02 rinçage ou OC > set point, taper OC en F47",{"$nulls":5},{"v":229,"d":"229 m"},null,"OC ou"," rinçage  =",{"v":2.5094999999999894,"d":"2.51"},{"v":9.44049999999996,"d":"9.44"},{"v":0.105,"d":"10.50%"},{"v":109.49999999999947,"d":"109 m"},{"v":126.02270502881768,"d":"126 m"},"hyperoxie","Narcose",{"v":5.439330543933077,"d":"5.44 "},{"v":94.56066945606692,"d":"94.561"},{"v":41.73347981580607,"d":"41.733 "},{"v":52.827189640260855,"d":"52.827 "},{"v":100.00000000000001,"d":"100 "}]
[23.9999999999999,"PP02 rinçage ou OC > set point, taper OC en F47",{"$nulls":5},{"v":230,"d":"230 m"},null,"OC ou"," rinçage  =",{"v":2.5199999999999894,"d":"2.52"},{"v":9.47999999999996,"d":"9.48"},{"v":0.105,"d":"10.50%"},{"v":109.99999999999949,"d":"110 m"},{"v":126.59183768584202,"d":"127 m"},"hyperoxie","Narcose",{"$f":"$Q$45/A280*100","v":{"v":5.416666666666689,"d":"5.42 "}},{"v":94.58333333333331,"d":"94.583"},{"v":41.74348230912476,"d":"41.743 "},{"v":52.839851024208556,"d":"52.840 "},{"v":100,"d":"100 "}]
[24.0999999999999,"PP02 rinçage ou OC > set point, taper OC en F47",{"$nulls":5},{"v":231,"d":"231 m"},null,"OC ou"," rinçage  =",{"v":2.5304999999999893,"d":"2.53"},{"v":9.51949999999996,"d":"9.52"},{"v":0.105,"d":"10.50%"},{"v":110.49999999999949,"d":"110 m"},{"v":127.16097034286636,"d":"127 m"},"hyperoxie","Narcose",{"v":5.394190871369318,"d":"5.39 "},{"v":94.60580912863068,"d":"94.606"},{"v":41.75340179420013,"d":"41.753 "},{"v":52.85240733443055,"d":"52.852 "},{"v":100,"d":"100 "}]
[24.1999999999999,"PP02 rinçage ou OC > set point, taper OC en F47",{"$nulls":5},{"v":232,"d":"232 m"},null,"OC ou"," rinçage  =",{"v":2.5409999999999893,"d":"2.54"},{"v":9.55899999999996,"d":"9.56"},{"v":0.105,"d":"10.50%"},{"v":110.99999999999949,"d":"111 m"},{"v":127.7301029998907,"d":"128 m"},"hyperoxie","Narcose",{"v":5.3719008264463035,"d":"5.37 "},{"v":94.6280991735537,"d":"94.628"},{"v":41.76323930006001,"d":"41.763 "},{"v":52.864859873493685,"d":"52.865 "},{"v":100,"d":"100 "}]
[24.2999999999999,"PP02 rinçage ou OC > set point, taper OC en F47",{"$nulls":5},{"v":233,"d":"233 m"},null,"OC ou"," rinçage  =",{"v":2.5514999999999897,"d":"2.55"},{"v":9.59849999999996,"d":"9.60"},{"v":0.105,"d":"10.50%"},{"v":111.49999999999949,"d":"111 m"},{"v":128.29923565691504,"d":"128 m"},"hyperoxie","Narcose",{"v":5.34979423868315,"d":"5.35 "},{"v":94.65020576131685,"d":"94.650"},{"v":41.77299583879347,"d":"41.773 "},{"v":52.87720992252338,"d":"52.877 "},{"v":99.99999999999999,"d":"100 "}]
[24.3999999999999,"PP02 rinçage ou OC > set point, taper OC en F47",{"$nulls":5},{"v":234,"d":"234 m"},null,"OC ou"," rinçage  =",{"v":2.5619999999999896,"d":"2.56"},{"v":9.637999999999959,"d":"9.64"},{"v":0.10500000000000001,"d":"10.50%"},{"v":111.99999999999949,"d":"112 m"},{"v":128.86836831393938,"d":"129 m"},"hyperoxie","Narcose",{"v":5.327868852459038,"d":"5.33 "},{"v":94.67213114754097,"d":"94.672"},{"v":41.78267240589797,"d":"41.783 "},{"v":52.88945874164299,"d":"52.889 "},{"v":100,"d":"100 "}]
[24.4999999999999,"PP02 rinçage ou OC > set point, taper OC en F47",{"$nulls":5},{"v":235,"d":"235 m"},null,"OC ou"," rinçage  =",{"$f":"IF($F$47=\"oc\",IF(A285*$E$20/100>$Q$45,A285*$E$20/100,$Q$45),$Q$45)","v":{"v":2.5724999999999896,"d":"2.57"}},{"v":9.67749999999996,"d":"9.68"},{"v":0.105,"d":"10.50%"},{"v":112.49999999999947,"d":"112 m"},{"v":129.43750097096373,"d":"129 m"},"hyperoxie","Narcose",{"v":5.306122448979614,"d":"5.31 "},{"v":94.69387755102039,"d":"94.694"},{"v":41.79226998061794,"d":"41.792 "},{"v":52.90160757040245,"d":"52.902 "},{"v":100,"d":"100 "}]
[24.5999999999999,{"$f":"IF(A286*$E$20/100>$Q$45,\"PP02 rinçage ou OC > set point, taper OC en F47\",\"\")","v":"PP02 rinçage ou OC > set point, taper OC en F47"},{"$nulls":5},{"v":236,"d":"236 m"},null,"OC ou",{"$f":"IF(J286=\"OC ou\",\" rinçage  =\",\"m\")","v":" rinçage  ="},{"v":2.5829999999999895,"d":"2.58"},{"v":9.71699999999996,"d":"9.72"},{"v":0.10500000000000001,"d":"10.50%"},{"v":112.99999999999947,"d":"113 m"},{"v":130.00663362798807,"d":"130 m"},{"$f":"IF(O286>(A286*10)-10,\"Pne>P\",IF(L286>1.4,\"hyperoxie\",\"\"))","v":"hyperoxie"},"Narcose",{"v":5.284552845528477,"d":"5.28 "},{"v":94.71544715447152,"d":"94.715"},{"v":41.80178952627514,"d":"41.802 "},{"v":52.91365762819639,"d":"52.914 "},{"v":100,"d":"100 "}]
[24.6999999999999,"PP02 rinçage ou OC > set point, taper OC en F47",{"$nulls":5},{"v":237,"d":"237 m"},null,"OC ou"," rinçage  =",{"v":2.5934999999999895,"d":"2.59"},{"v":9.75649999999996,"d":"9.76"},{"v":0.105,"d":"10.50%"},{"v":113.49999999999949,"d":"113 m"},{"v":130.5757662850124,"d":"131 m"},"hyperoxie","Narcose",{"v":5.263157894736863,"d":"5.26 "},{"v":94.73684210526314,"d":"94.737"},{"v":41.81123199059099,"d":"41.811 "},{"v":52.925610114672146,"d":"52.926 "},{"v":100,"d":"100 "}]
[24.7999999999999,"PP02 rinçage ou OC > set point, taper OC en F47",{"$nulls":5},{"v":238,"d":"238 m"},null,"OC ou"," rinçage  =",{"v":2.6039999999999894,"d":"2.60"},{"v":9.79599999999996,"d":"9.80"},{"v":0.105,"d":"10.50%"},{"v":113.9999999999995,"d":"114 m"},{"v":131.14489894203678,"d":"131 m"},"hyperoxie","Narcose",{"v":5.241935483870988,"d":"5.24 "},{"v":94.75806451612901,"d":"94.758"},{"v":41.820598306001074,"d":"41.821 "},{"v":52.93746621012794,"d":"52.937 "},{"v":100,"d":"100 "}]
[24.8999999999999,"PP02 rinçage ou OC > set point, taper OC en F47",{"$nulls":5},{"v":239,"d":"239 m"},null,"OC ou"," rinçage  =",{"v":2.61449999999999,"d":"2.61"},{"v":9.83549999999996,"d":"9.84"},{"v":0.10500000000000002,"d":"10.50%"},{"v":114.4999999999995,"d":"115 m"},{"v":131.7140315990611,"d":"132 m"},"hyperoxie","Narcose",{"v":5.220883534136568,"d":"5.22 "},{"v":94.77911646586344,"d":"94.779"},{"v":41.82988938996208,"d":"41.830 "},{"v":52.949227075901355,"d":"52.949 "},{"v":100,"d":"100 "}]
[24.9999999999999,"PP02 rinçage ou OC > set point, taper OC en F47",{"$nulls":5},{"v":240,"d":"240 m"},null,"OC ou"," rinçage  =",{"v":2.62499999999999,"d":"2.62"},{"v":9.874999999999961,"d":"9.87"},{"v":0.10500000000000001,"d":"10.50%"},{"v":114.99999999999949,"d":"115 m"},{"v":132.28316425608546,"d":"132 m"},"hyperoxie","Narcose",{"v":5.200000000000021,"d":"5.20 "},{"v":94.79999999999998,"d":"94.800"},{"v":41.839106145251385,"d":"41.839 "},{"v":52.96089385474859,"d":"52.961 "},{"v":100,"d":"100 "}]
[25.0999999999999,"PP02 rinçage ou OC > set point, taper OC en F47",{"$nulls":5},{"v":241,"d":"241 m"},null,"OC ou"," rinçage  =",{"v":2.6354999999999893,"d":"2.64"},{"v":9.91449999999996,"d":"9.91"},{"v":0.105,"d":"10.50%"},{"v":115.49999999999949,"d":"115 m"},{"v":132.85229691310977,"d":"133 m"},"hyperoxie","Narcose",{"v":5.179282868525918,"d":"5.18 "},{"v":94.82071713147408,"d":"94.821"},{"v":41.84824946025951,"d":"41.848 "},{"v":52.972467671214574,"d":"52.972 "},{"v":100,"d":"100 "}]
[25.1999999999999,"PP02 rinçage ou OC > set point, taper OC en F47",{"$nulls":5},{"v":242,"d":"242 m"},null,"OC ou"," rinçage  =",{"v":2.6459999999999892,"d":"2.65"},{"v":9.95399999999996,"d":"9.95"},{"v":0.105,"d":"10.50%"},{"v":115.99999999999947,"d":"116 m"},{"v":133.42142957013414,"d":"133 m"},"hyperoxie","Narcose",{"v":5.1587301587301795,"d":"5.16 "},{"v":94.84126984126982,"d":"94.841"},{"v":41.85732020927551,"d":"41.857 "},{"v":52.983949631994314,"d":"52.984 "},{"v":100,"d":"100 "}]
[25.2999999999999,"PP02 rinçage ou OC > set point, taper OC en F47",{"$nulls":5},{"v":243,"d":"243 m"},null,"OC ou"," rinçage  =",{"v":2.6564999999999896,"d":"2.66"},{"v":9.99349999999996,"d":"9.99"},{"v":0.105,"d":"10.50%"},{"v":116.49999999999949,"d":"116 m"},{"v":133.99056222715848,"d":"134 m"},"hyperoxie","Narcose",{"v":5.138339920948637,"d":"5.14 "},{"v":94.86166007905136,"d":"94.862"},{"v":41.866319252765685,"d":"41.866 "},{"v":52.99534082628568,"d":"52.995 "},{"v":100,"d":"100 "}]
[25.3999999999999,"PP02 rinçage ou OC > set point, taper OC en F47",{"$nulls":5},{"v":244,"d":"244 m"},null,"OC ou"," rinçage  =",{"v":2.6669999999999896,"d":"2.67"},{"v":10.03299999999996,"d":"10.03"},{"v":0.10500000000000001,"d":"10.50%"},{"v":116.99999999999949,"d":"117 m"},{"v":134.55969488418282,"d":"135 m"},"hyperoxie","Narcose",{"v":5.1181102362204935,"d":"5.12 "},{"v":94.88188976377951,"d":"94.882"},{"v":41.875247437645704,"d":"41.875 "},{"v":53.0066423261338,"d":"53.007 "},{"v":99.99999999999999,"d":"100 "}]
[25.4999999999999,"PP02 rinçage ou OC > set point, taper OC en F47",{"$nulls":5},{"v":245,"d":"245 m"},null,"OC ou"," rinçage  =",{"v":2.6774999999999896,"d":"2.68"},{"v":10.07249999999996,"d":"10.07"},{"v":0.105,"d":"10.50%"},{"v":117.4999999999995,"d":"118 m"},{"v":135.12882754120716,"d":"135 m"},"hyperoxie","Narcose",{"v":5.098039215686295,"d":"5.10 "},{"v":94.9019607843137,"d":"94.902"},{"v":41.88410559754627,"d":"41.884 "},{"v":53.01785518676744,"d":"53.018 "},{"v":100,"d":"100 "}]
[25.5999999999999,"PP02 rinçage ou OC > set point, taper OC en F47",{"$nulls":5},{"v":246,"d":"246 m"},null,"OC ou"," rinçage  =",{"v":2.6879999999999895,"d":"2.69"},{"v":10.11199999999996,"d":"10.11"},{"v":0.10500000000000001,"d":"10.50%"},{"v":117.99999999999947,"d":"118 m"},{"v":135.6979601982315,"d":"136 m"},"hyperoxie","Narcose",{"v":5.07812500000002,"d":"5.08 "},{"v":94.92187499999999,"d":"94.922"},{"v":41.892894553072615,"d":"41.893 "},{"v":53.02898044692736,"d":"53.029 "},{"v":99.99999999999999,"d":"100 "}]
[25.6999999999999,"PP02 rinçage ou OC > set point, taper OC en F47",{"$nulls":5},{"v":247,"d":"247 m"},null,"OC ou"," rinçage  =",{"v":2.6984999999999895,"d":"2.70"},{"v":10.15149999999996,"d":"10.15"},{"v":0.105,"d":"10.50%"},{"v":118.49999999999946,"d":"118 m"},{"v":136.26709285525587,"d":"136 m"},"hyperoxie","Narcose",{"v":5.058365758754884,"d":"5.06 "},{"v":94.94163424124511,"d":"94.942"},{"v":41.9016151120579,"d":"41.902 "},{"v":53.04001912918722,"d":"53.040 "},{"v":100,"d":"100 "}]
[25.7999999999999,"PP02 rinçage ou OC > set point, taper OC en F47",{"$nulls":5},{"v":248,"d":"248 m"},null,"OC ou"," rinçage  =",{"v":2.7089999999999894,"d":"2.71"},{"v":10.19099999999996,"d":"10.19"},{"v":0.105,"d":"10.50%"},{"v":118.99999999999949,"d":"119 m"},{"v":136.8362255122802,"d":"137 m"},"hyperoxie","Narcose",{"v":5.0387596899225,"d":"5.04 "},{"v":94.9612403100775,"d":"94.961"},{"v":41.91026806981074,"d":"41.910 "},{"v":53.05097224026676,"d":"53.051 "},{"v":100,"d":"100 "}]
[25.8999999999999,"PP02 rinçage ou OC > set point, taper OC en F47",{"$nulls":5},{"v":249,"d":"249 m"},null,"OC ou"," rinçage  =",{"v":2.71949999999999,"d":"2.72"},{"v":10.23049999999996,"d":"10.23"},{"v":0.10500000000000001,"d":"10.50%"},{"v":119.49999999999949,"d":"119 m"},{"v":137.40535816930455,"d":"137 m"},"hyperoxie","Narcose",{"v":5.0193050193050395,"d":"5.02 "},{"v":94.98069498069496,"d":"94.981"},{"v":41.918854209356994,"d":"41.919 "},{"v":53.06184077133797,"d":"53.062 "},{"v":100,"d":"100 "}]
[25.9999999999999,"PP02 rinçage ou OC > set point, taper OC en F47",{"$nulls":5},{"v":250,"d":"250 m"},null,"OC ou"," rinçage  =",{"v":2.7299999999999898,"d":"2.73"},{"v":10.26999999999996,"d":"10.27"},{"v":0.10500000000000001,"d":"10.50%"},{"v":119.99999999999949,"d":"120 m"},{"v":137.9744908263289,"d":"138 m"},"hyperoxie","Narcose",{"v":5.000000000000019,"d":"5.00 "},{"v":94.99999999999999,"d":"95.000"},{"v":41.92737430167597,"d":"41.927 "},{"v":53.07262569832401,"d":"53.073 "},{"v":99.99999999999999,"d":"100 "}]
[26.0999999999999,"PP02 rinçage ou OC > set point, taper OC en F47",{"$nulls":5},{"v":251,"d":"251 m"},null,"OC ou"," rinçage  =",{"v":2.7404999999999893,"d":"2.74"},{"v":10.309499999999959,"d":"10.31"},{"v":0.105,"d":"10.50%"},{"v":120.49999999999946,"d":"120 m"},{"v":138.54362348335323,"d":"139 m"},"hyperoxie","Narcose",{"v":4.9808429118774145,"d":"4.98 "},{"v":95.01915708812258,"d":"95.019"},{"v":41.93582910593119,"d":"41.936 "},{"v":53.08332798219139,"d":"53.083 "},{"v":100,"d":"100 "}]
[26.1999999999999,"PP02 rinçage ou OC > set point, taper OC en F47",{"$nulls":5},{"v":252,"d":"252 m"},null,"OC ou"," rinçage  =",{"v":2.7509999999999892,"d":"2.75"},{"v":10.34899999999996,"d":"10.35"},{"v":0.105,"d":"10.50%"},{"v":120.99999999999949,"d":"121 m"},{"v":139.11275614037757,"d":"139 m"},"hyperoxie","Narcose",{"v":4.961832061068722,"d":"4.96 "},{"v":95.03816793893128,"d":"95.038"},{"v":41.94421936969593,"d":"41.944 "},{"v":53.09394856923535,"d":"53.094 "},{"v":100,"d":"100 "}]
[26.2999999999999,"PP02 rinçage ou OC > set point, taper OC en F47",{"$nulls":5},{"v":253,"d":"253 m"},null,"OC ou"," rinçage  =",{"v":2.7614999999999896,"d":"2.76"},{"v":10.38849999999996,"d":"10.39"},{"v":0.105,"d":"10.50%"},{"v":121.49999999999949,"d":"121 m"},{"v":139.6818887974019,"d":"140 m"},"hyperoxie","Narcose",{"v":4.942965779467699,"d":"4.94 "},{"v":95.0570342205323,"d":"95.057"},{"v":41.952545829173474,"d":"41.953 "},{"v":53.10448839135883,"d":"53.104 "},{"v":100,"d":"100 "}]
[26.3999999999999,"PP02 rinçage ou OC > set point, taper OC en F47",{"$nulls":5},{"v":254,"d":"254 m"},null,"OC ou"," rinçage  =",{"v":2.7719999999999896,"d":"2.77"},{"v":10.427999999999962,"d":"10.43"},{"v":0.10500000000000001,"d":"10.50%"},{"v":121.99999999999952,"d":"122 m"},{"v":140.25102145442625,"d":"140 m"},"hyperoxie","Narcose",{"v":4.924242424242443,"d":"4.92 "},{"v":95.07575757575756,"d":"95.076"},{"v":41.96080920941255,"d":"41.961 "},{"v":53.114948366345004,"d":"53.115 "},{"v":100,"d":"100 "}]
[26.4999999999999,"PP02 rinçage ou OC > set point, taper OC en F47",{"$nulls":5},{"v":255,"d":"255 m"},null,"OC ou"," rinçage  =",{"v":2.78249999999999,"d":"2.78"},{"v":10.467499999999962,"d":"10.47"},{"v":0.10500000000000001,"d":"10.50%"},{"v":122.49999999999952,"d":"123 m"},{"v":140.82015411145062,"d":"141 m"},"hyperoxie","Narcose",{"v":4.905660377358509,"d":"4.91 "},{"v":95.09433962264148,"d":"95.094"},{"v":41.969010224517746,"d":"41.969 "},{"v":53.125329398123746,"d":"53.125 "},{"v":100,"d":"100 "}]
[26.5999999999999,"PP02 rinçage ou OC > set point, taper OC en F47",{"$nulls":5},{"v":256,"d":"256 m"},null,"OC ou"," rinçage  =",{"v":2.7929999999999895,"d":"2.79"},{"v":10.506999999999959,"d":"10.51"},{"v":0.10500000000000001,"d":"10.50%"},{"v":122.99999999999949,"d":"123 m"},{"v":141.38928676847496,"d":"141 m"},"hyperoxie","Narcose",{"v":4.887218045112801,"d":"4.89 "},{"v":95.1127819548872,"d":"95.113"},{"v":41.97714957785524,"d":"41.977 "},{"v":53.13563237703195,"d":"53.136 "},{"v":100,"d":"100 "}]
[26.6999999999999,"PP02 rinçage ou OC > set point, taper OC en F47",{"$nulls":5},{"v":257,"d":"257 m"},null,"OC ou"," rinçage  =",{"v":2.8034999999999894,"d":"2.80"},{"v":10.54649999999996,"d":"10.55"},{"v":0.105,"d":"10.50%"},{"v":123.49999999999949,"d":"123 m"},{"v":141.9584194254993,"d":"142 m"},"hyperoxie","Narcose",{"v":4.868913857677921,"d":"4.87 "},{"v":95.13108614232208,"d":"95.131"},{"v":41.98522796225387,"d":"41.985 "},{"$f":"100-(S307+U307)","v":{"v":53.1458581800682,"d":"53.146 "}},{"$f":"V307+U307+S307","v":{"v":100,"d":"100 "}}]
[26.7999999999999,"PP02 rinçage ou OC > set point, taper OC en F47",{"$nulls":5},{"v":258,"d":"258 m"},null,"OC ou"," rinçage  =",{"v":2.8139999999999894,"d":"2.81"},{"v":10.585999999999961,"d":"10.59"},{"v":0.105,"d":"10.50%"},{"v":123.99999999999952,"d":"124 m"},{"$f":"IF(J308=\"OC ou\",(((((($E$20%*1.428)+($F$20%*0.178)+($D$23%*1.25))*A308))/1.28738)*10)-10,((((((S308%*1.428)+(V308%*0.178)+(U308%*1.25))*A308))/1.28738)*10)-10)","v":{"v":142.52755208252364,"d":"143 m"}},"hyperoxie","Narcose",{"v":4.850746268656734,"d":"4.85 "},{"v":95.14925373134326,"d":"95.149"},{"v":41.99324606020178,"d":"41.993 "},{"v":53.15600767114149,"d":"53.156 "},{"v":100,"d":"100 "}]
[26.8999999999999,"PP02 rinçage ou OC > set point, taper OC en F47",{"$nulls":5},{"v":259,"d":"259 m"},null,"OC ou"," rinçage  =",{"v":2.82449999999999,"d":"2.82"},{"v":10.625499999999962,"d":"10.63"},{"v":0.10500000000000001,"d":"10.50%"},{"v":124.49999999999949,"d":"124 m"},{"v":143.09668473954798,"d":"143 m"},"hyperoxie","Narcose",{"v":4.832713754646859,"d":"4.83 "},{"v":95.16728624535314,"d":"95.167"},{"v":42.001204544038536,"d":"42.001 "},{"v":53.1660817013146,"d":"53.166 "},{"v":100,"d":"100 "}]
[26.9999999999999,"PP02 rinçage ou OC > set point, taper OC en F47",{"$nulls":5},{"v":260,"d":"260 m"},null,"OC ou"," rinçage  =",{"v":2.8349999999999898,"d":"2.83"},{"v":10.664999999999962,"d":"10.67"},{"v":0.10500000000000001,"d":"10.50%"},{"v":124.99999999999952,"d":"125 m"},{"v":143.66581739657235,"d":"144 m"},"hyperoxie","Narcose",{"v":4.814814814814833,"d":"4.81 "},{"v":95.18518518518516,"d":"95.185"},{"v":42.00910407614317,"d":"42.009 "},{"v":53.176081109042,"d":"53.176 "},{"v":100,"d":"100 "}]
[27.0999999999999,"PP02 rinçage ou OC > set point, taper OC en F47",{"$nulls":5},{"v":261,"d":"261 m"},null,"OC ou"," rinçage  =",{"v":2.8454999999999893,"d":"2.85"},{"v":10.70449999999996,"d":"10.70"},{"v":0.105,"d":"10.50%"},{"v":125.49999999999949,"d":"125 m"},{"v":144.23495005359666,"d":"144 m"},"hyperoxie","Narcose",{"v":4.797047970479723,"d":"4.80 "},{"v":95.20295202952028,"d":"95.203"},{"v":42.01694530911789,"d":"42.017 "},{"v":53.18600672040239,"d":"53.186 "},{"v":100,"d":"100 "}]
[27.1999999999999,"PP02 rinçage ou OC > set point, taper OC en F47",{"$nulls":5},{"v":262,"d":"262 m"},null,"OC ou"," rinçage  =",{"v":2.855999999999989,"d":"2.86"},{"v":10.74399999999996,"d":"10.74"},{"v":0.105,"d":"10.50%"},{"v":125.99999999999949,"d":"126 m"},{"v":144.80408271062103,"d":"145 m"},"hyperoxie","Narcose",{"v":4.7794117647059,"d":"4.78 "},{"v":95.2205882352941,"d":"95.221"},{"v":42.02472888596779,"d":"42.025 "},{"v":53.19585934932631,"d":"53.196 "},{"v":100,"d":"100 "}]
[27.2999999999999,"PP02 rinçage ou OC > set point, taper OC en F47",{"$nulls":5},{"v":263,"d":"263 m"},null,{"$f":"IF($F$47=\"oc\",IF($E$20>S313,\"OC ou\",(A313-1)*10),(A313-1)*10)","v":"OC ou"}," rinçage  =",{"v":2.8664999999999896,"d":"2.87"},{"v":10.783499999999961,"d":"10.78"},{"v":0.105,"d":"10.50%"},{"v":126.49999999999949,"d":"126 m"},{"v":145.37321536764537,"d":"145 m"},"hyperoxie","Narcose",{"v":4.761904761904779,"d":"4.76 "},{"$f":"100-S313","v":{"v":95.23809523809523,"d":"95.238"}},{"$f":"T313/($T$47+1)","v":{"v":42.032455440276664,"d":"42.032 "}},{"v":53.205639797818556,"d":"53.206 "},{"v":99.99999999999999,"d":"100 "}]
[27.3999999999999,"PP02 rinçage ou OC > set point, taper OC en F47",{"$nulls":5},{"v":264,"d":"264 m"},null,"OC ou"," rinçage  =",{"v":2.8769999999999896,"d":"2.88"},{"$f":"IF($R$47=0,0,IF(K314=\"m\",U314*A314/100,$R$47*A314/100))","v":{"v":10.822999999999961,"d":"10.82"}},{"$f":"IF(K314=\"m\",S314/100,L314/A314)","v":{"v":0.10500000000000001,"d":"10.50%"}},{"v":126.99999999999952,"d":"127 m"},{"v":145.9423480246697,"d":"146 m"},"hyperoxie",{"$f":"IF(M314>5.53,\"Narcose\",IF(M314>3.56,\"Pne>à35m\",\"\"))","v":"Narcose"},{"v":4.744525547445273,"d":"4.74 "},{"v":95.25547445255472,"d":"95.255"},{"v":42.0401255963789,"d":"42.040 "},{"v":53.21534885617583,"d":"53.215 "},{"v":100,"d":"100 "}]
[27.4999999999999,"PP02 rinçage ou OC > set point, taper OC en F47",{"$nulls":5},{"v":265,"d":"265 m"},null,"OC ou"," rinçage  =",{"v":2.88749999999999,"d":"2.89"},{"v":10.862499999999962,"d":"10.86"},{"v":0.10500000000000001,"d":"10.50%"},{"v":127.49999999999952,"d":"128 m"},{"v":146.51148068169405,"d":"147 m"},"hyperoxie","Narcose",{"v":4.727272727272744,"d":"4.73 "},{"v":95.27272727272725,"d":"95.273"},{"v":42.04773996952767,"d":"42.048 "},{"v":53.22498730319958,"d":"53.225 "},{"v":100,"d":"100 "}]
[27.5999999999999,"PP02 rinçage ou OC > set point, taper OC en F47",{"$nulls":5},{"v":266,"d":"266 m"},null,"OC ou"," rinçage  =",{"v":2.8979999999999895,"d":"2.90"},{"v":10.90199999999996,"d":"10.90"},{"v":0.10500000000000001,"d":"10.50%"},{"v":127.99999999999949,"d":"128 m"},{"v":147.0806133387184,"d":"147 m"},"hyperoxie","Narcose",{"v":4.710144927536249,"d":"4.71 "},{"v":95.28985507246375,"d":"95.290"},{"v":42.05529916605942,"d":"42.055 "},{"v":53.23455590640433,"d":"53.235 "},{"v":100,"d":"100 "}]
[27.6999999999999,"PP02 rinçage ou OC > set point, taper OC en F47",{"$nulls":5},{"v":267,"d":"267 m"},null,"OC ou"," rinçage  =",{"$f":"IF($F$47=\"oc\",IF(A317*$E$20/100>$Q$45,A317*$E$20/100,$Q$45),$Q$45)","v":{"v":2.9084999999999894,"d":"2.91"}},{"v":10.94149999999996,"d":"10.94"},{"v":0.105,"d":"10.50%"},{"v":128.4999999999995,"d":"128 m"},{"v":147.64974599574273,"d":"148 m"},"hyperoxie","Narcose",{"v":4.693140794223845,"d":"4.69 "},{"v":95.30685920577615,"d":"95.307"},{"v":42.062803783554834,"d":"42.063 "},{"v":53.24405542222132,"d":"53.244 "},{"v":100.00000000000001,"d":"100 "}]
[27.7999999999999,"PP02 rinçage ou OC > set point, taper OC en F47",{"$nulls":5},{"v":268,"d":"268 m"},null,"OC ou"," rinçage  =",{"v":2.9189999999999894,"d":"2.92"},{"v":10.98099999999996,"d":"10.98"},{"v":0.105,"d":"10.50%"},{"$f":"IF(M318=\"\",\"\",IF(M318<0,\"!\",IF(M318<0.79,0,(10*M318)/0.79-7.9/0.79)))","v":{"v":128.9999999999995,"d":"129 m"}},{"v":148.2188786527671,"d":"148 m"},"hyperoxie","Narcose",{"v":4.6762589928057725,"d":"4.68 "},{"v":95.32374100719423,"d":"95.324"},{"v":42.070254410996334,"d":"42.070 "},{"v":53.253486596197895,"d":"53.253 "},{"v":100,"d":"100 "}]
[27.8999999999999,"PP02 rinçage ou OC > set point, taper OC en F47",{"$nulls":5},{"v":269,"d":"269 m"},null,"OC ou"," rinçage  =",{"v":2.92949999999999,"d":"2.93"},{"v":11.020499999999961,"d":"11.02"},{"v":0.10500000000000001,"d":"10.50%"},{"v":129.49999999999952,"d":"130 m"},{"v":148.78801130979144,"d":"149 m"},"hyperoxie","Narcose",{"v":4.6594982078853215,"d":"4.66 "},{"v":95.34050179211468,"d":"95.341"},{"v":42.07765162892212,"d":"42.078 "},{"v":53.26285016319256,"d":"53.263 "},{"v":100,"d":"100 "}]
[27.9999999999999,"PP02 rinçage ou OC > set point, taper OC en F47",{"$nulls":5},{"v":270,"d":"270 m"},null,"OC ou"," rinçage  =",{"v":2.9399999999999897,"d":"2.94"},{"v":11.059999999999961,"d":"11.06"},{"v":0.10500000000000001,"d":"10.50%"},{"v":129.9999999999995,"d":"130 m"},{"v":149.35714396681578,"d":"149 m"},"hyperoxie","Narcose",{"v":4.64285714285716,"d":"4.64 "},{"v":95.35714285714283,"d":"95.357"},{"v":42.084996009577004,"d":"42.085 "},{"v":53.272146847565836,"d":"53.272 "},{"v":100,"d":"100 "}]
[28.0999999999999,"PP02 rinçage ou OC > set point, taper OC en F47",{"$nulls":5},{"v":271,"d":"271 m"},null,"OC ou"," rinçage  =",{"v":2.9504999999999892,"d":"2.95"},{"v":11.09949999999996,"d":"11.10"},{"v":0.105,"d":"10.50%"},{"v":130.4999999999995,"d":"130 m"},{"v":149.92627662384012,"d":"150 m"},"hyperoxie","Narcose",{"v":4.62633451957297,"d":"4.63 "},{"v":95.37366548042704,"d":"95.374"},{"v":42.09228811705997,"d":"42.092 "},{"v":53.281377363367056,"d":"53.281 "},{"v":100,"d":"100 "}]
[28.1999999999999,"PP02 rinçage ou OC > set point, taper OC en F47",{"$nulls":5},{"v":272,"d":"272 m"},null,"OC ou"," rinçage  =",{"v":2.9609999999999896,"d":"2.96"},{"v":11.13899999999996,"d":"11.14"},{"v":0.10500000000000001,"d":"10.50%"},{"v":130.9999999999995,"d":"131 m"},{"v":150.49540928086446,"d":"150 m"},"hyperoxie","Narcose",{"v":4.609929078014201,"d":"4.61 "},{"v":95.3900709219858,"d":"95.390"},{"v":42.09952850746859,"d":"42.100 "},{"v":53.290542414517205,"d":"53.291 "},{"v":100,"d":"100 "}]
[28.2999999999999,"PP02 rinçage ou OC > set point, taper OC en F47",{"$nulls":5},{"v":273,"d":"273 m"},null,"OC ou"," rinçage  =",{"v":2.9714999999999896,"d":"2.97"},{"v":11.17849999999996,"d":"11.18"},{"v":0.105,"d":"10.50%"},{"v":131.4999999999995,"d":"131 m"},{"v":151.0645419378888,"d":"151 m"},"hyperoxie","Narcose",{"v":4.593639575971747,"d":"4.59 "},{"v":95.40636042402825,"d":"95.406"},{"v":42.1067177290404,"d":"42.107 "},{"v":53.29964269498785,"d":"53.300 "},{"v":100,"d":"100 "}]
[28.3999999999999,"PP02 rinçage ou OC > set point, taper OC en F47",{"$nulls":5},{"v":274,"d":"274 m"},null,"OC ou"," rinçage  =",{"v":2.9819999999999895,"d":"2.98"},{"v":11.217999999999961,"d":"11.22"},{"v":0.10500000000000001,"d":"10.50%"},{"v":131.9999999999995,"d":"132 m"},{"v":151.63367459491315,"d":"152 m"},"hyperoxie","Narcose",{"v":4.57746478873241,"d":"4.58 "},{"v":95.42253521126759,"d":"95.423"},{"v":42.11385632229128,"d":"42.114 "},{"v":53.30867888897632,"d":"53.309 "},{"v":100,"d":"100 "}]
[28.4999999999999,"PP02 rinçage ou OC > set point, taper OC en F47",{"$nulls":5},{"v":275,"d":"275 m"},null,"OC ou"," rinçage  =",{"v":2.99249999999999,"d":"2.99"},{"v":11.257499999999961,"d":"11.26"},{"v":0.10500000000000001,"d":"10.50%"},{"v":132.49999999999952,"d":"133 m"},{"v":152.2028072519375,"d":"152 m"},"hyperoxie","Narcose",{"v":4.561403508771946,"d":"4.56 "},{"v":95.43859649122805,"d":"95.439"},{"v":42.120944820150925,"d":"42.121 "},{"v":53.31765167107713,"d":"53.318 "},{"v":100,"d":"100 "}]
[28.5999999999999,"PP02 rinçage ou OC > set point, taper OC en F47",{"$nulls":5},{"v":276,"d":"276 m"},null,"OC ou"," rinçage  =",{"v":3.0029999999999895,"d":"3.00"},{"v":11.29699999999996,"d":"11.30"},{"v":0.10500000000000001,"d":"10.50%"},{"v":132.9999999999995,"d":"133 m"},{"v":152.77193990896183,"d":"153 m"},"hyperoxie","Narcose",{"v":4.545454545454562,"d":"4.55 "},{"v":95.45454545454544,"d":"95.455"},{"v":42.127983748095474,"d":"42.128 "},{"v":53.326561706449965,"d":"53.327 "},{"v":100,"d":"100 "}]
[28.6999999999999,"PP02 rinçage ou OC > set point, taper OC en F47",{"$nulls":5},{"v":277,"d":"277 m"},null,"OC ou"," rinçage  =",{"v":3.0134999999999894,"d":"3.01"},{"v":11.33649999999996,"d":"11.34"},{"v":0.105,"d":"10.50%"},{"v":133.4999999999995,"d":"133 m"},{"v":153.34107256598617,"d":"153 m"},"hyperoxie","Narcose",{"v":4.529616724738692,"d":"4.53 "},{"v":95.47038327526131,"d":"95.470"},{"v":42.134973624277336,"d":"42.135 "},{"v":53.33540965098397,"d":"53.335 "},{"v":99.99999999999999,"d":"100 "}]
[28.7999999999999,"PP02 rinçage ou OC > set point, taper OC en F47",{"$nulls":5},{"v":278,"d":"278 m"},null,"OC ou"," rinçage  =",{"v":3.0239999999999894,"d":"3.02"},{"v":11.37599999999996,"d":"11.38"},{"v":0.105,"d":"10.50%"},{"v":133.9999999999995,"d":"134 m"},{"v":153.91020522301056,"d":"154 m"},"hyperoxie","Narcose",{"v":4.513888888888904,"d":"4.51 "},{"v":95.4861111111111,"d":"95.486"},{"v":42.14191495965238,"d":"42.142 "},{"v":53.34419615145871,"d":"53.344 "},{"v":99.99999999999999,"d":"100 "}]
[28.8999999999999,"PP02 rinçage ou OC > set point, taper OC en F47",{"$nulls":5},{"v":279,"d":"279 m"},null,"OC ou"," rinçage  =",{"v":3.0344999999999898,"d":"3.03"},{"v":11.41549999999996,"d":"11.42"},{"v":0.10500000000000001,"d":"10.50%"},{"v":134.4999999999995,"d":"134 m"},{"v":154.47933788003485,"d":"154 m"},"hyperoxie","Narcose",{"v":4.498269896193788,"d":"4.50 "},{"v":95.50173010380621,"d":"95.502"},{"v":42.14880825810442,"d":"42.149 "},{"v":53.35292184570179,"d":"53.353 "},{"v":100,"d":"100 "}]
[28.9999999999999,"PP02 rinçage ou OC > set point, taper OC en F47",{"$nulls":5},{"v":280,"d":"280 m"},null,"OC ou"," rinçage  =",{"v":3.0449999999999897,"d":"3.04"},{"v":11.454999999999961,"d":"11.46"},{"v":0.10500000000000001,"d":"10.50%"},{"v":134.99999999999952,"d":"135 m"},{"v":155.04847053705925,"d":"155 m"},"hyperoxie","Narcose",{"v":4.482758620689671,"d":"4.48 "},{"v":95.51724137931033,"d":"95.517"},{"v":42.15565401656713,"d":"42.156 "},{"v":53.3615873627432,"d":"53.362 "},{"v":99.99999999999999,"d":"100 "}]
[29.0999999999999,"PP02 rinçage ou OC > set point, taper OC en F47",{"$nulls":5},{"v":281,"d":"281 m"},null,"OC ou"," rinçage  =",{"v":3.0554999999999892,"d":"3.06"},{"v":11.49449999999996,"d":"11.49"},{"v":0.105,"d":"10.50%"},{"v":135.4999999999995,"d":"135 m"},{"v":155.61760319408353,"d":"156 m"},"hyperoxie","Narcose",{"v":4.4673539518900505,"d":"4.47 "},{"v":95.53264604810995,"d":"95.533"},{"v":42.162452725143496,"d":"42.162 "},{"v":53.37019332296646,"d":"53.370 "},{"v":100,"d":"100 "}]
[29.1999999999999,"PP02 rinçage ou OC > set point, taper OC en F47",{"$nulls":5},{"v":282,"d":"282 m"},null,"OC ou"," rinçage  =",{"v":3.0659999999999896,"d":"3.07"},{"v":11.53399999999996,"d":"11.53"},{"v":0.10500000000000001,"d":"10.50%"},{"v":135.9999999999995,"d":"136 m"},{"v":156.18673585110793,"d":"156 m"},"hyperoxie","Narcose",{"v":4.4520547945205635,"d":"4.45 "},{"v":95.54794520547944,"d":"95.548"},{"v":42.16920486722277,"d":"42.169 "},{"v":53.37874033825667,"d":"53.379 "},{"v":100,"d":"100 "}]
[29.2999999999999,"PP02 rinçage ou OC > set point, taper OC en F47",{"$nulls":5},{"v":283,"d":"283 m"},null,"OC ou"," rinçage  =",{"v":3.0764999999999896,"d":"3.08"},{"v":11.57349999999996,"d":"11.57"},{"v":0.105,"d":"10.50%"},{"v":136.4999999999995,"d":"136 m"},{"v":156.75586850813227,"d":"157 m"},"hyperoxie","Narcose",{"v":4.436860068259401,"d":"4.44 "},{"v":95.5631399317406,"d":"95.563"},{"v":42.17591091959501,"d":"42.176 "},{"v":53.38722901214559,"d":"53.387 "},{"v":100.00000000000001,"d":"100 "}]
[29.3999999999999,"PP02 rinçage ou OC > set point, taper OC en F47",{"$nulls":5},{"v":284,"d":"284 m"},null,"OC ou"," rinçage  =",{"v":3.0869999999999895,"d":"3.09"},{"v":11.61299999999996,"d":"11.61"},{"v":0.10500000000000001,"d":"10.50%"},{"v":136.9999999999995,"d":"137 m"},{"v":157.3250011651566,"d":"157 m"},"hyperoxie","Narcose",{"v":4.421768707483008,"d":"4.42 "},{"v":95.57823129251699,"d":"95.578"},{"v":42.182571352563365,"d":"42.183 "},{"v":53.395659939953624,"d":"53.396 "},{"v":100,"d":"100 "}]
[29.4999999999999,"PP02 rinçage ou OC > set point, taper OC en F47",{"$nulls":5},{"v":285,"d":"285 m"},null,"OC ou"," rinçage  =",{"v":3.09749999999999,"d":"3.10"},{"v":11.65249999999996,"d":"11.65"},{"v":0.10500000000000001,"d":"10.50%"},{"v":137.4999999999995,"d":"137 m"},{"v":157.89413382218095,"d":"158 m"},"hyperoxie","Narcose",{"v":4.406779661016964,"d":"4.41 "},{"v":95.59322033898303,"d":"95.593"},{"v":42.18918663005396,"d":"42.189 "},{"v":53.40403370892908,"d":"53.404 "},{"v":100,"d":"100 "}]
[29.5999999999999,"PP02 rinçage ou OC > set point, taper OC en F47",{"$nulls":5},{"v":286,"d":"286 m"},null,"OC ou"," rinçage  =",{"v":3.1079999999999894,"d":"3.11"},{"v":11.69199999999996,"d":"11.69"},{"v":0.10500000000000001,"d":"10.50%"},{"v":137.99999999999946,"d":"138 m"},{"v":158.4632664792053,"d":"158 m"},"hyperoxie","Narcose",{"v":4.391891891891907,"d":"4.39 "},{"v":95.6081081081081,"d":"95.608"},{"v":42.19575720972369,"d":"42.196 "},{"v":53.4123508983844,"d":"53.412 "},{"v":100,"d":"100 "}]
[29.6999999999999,"PP02 rinçage ou OC > set point, taper OC en F47",{"$nulls":5},{"v":287,"d":"287 m"},null,"OC ou"," rinçage  =",{"v":3.1184999999999894,"d":"3.12"},{"v":11.73149999999996,"d":"11.73"},{"v":0.105,"d":"10.50%"},{"v":138.4999999999995,"d":"138 m"},{"v":159.03239913622963,"d":"159 m"},"hyperoxie","Narcose",{"v":4.377104377104392,"d":"4.38 "},{"v":95.62289562289561,"d":"95.623"},{"v":42.20228354306566,"d":"42.202 "},{"v":53.420612079829944,"d":"53.421 "},{"v":100,"d":"100 "}]
[29.7999999999999,"PP02 rinçage ou OC > set point, taper OC en F47",{"$nulls":5},{"v":288,"d":"288 m"},null,"OC ou"," rinçage  =",{"v":3.1289999999999893,"d":"3.13"},{"v":11.77099999999996,"d":"11.77"},{"v":0.105,"d":"10.50%"},{"v":138.9999999999995,"d":"139 m"},{"v":159.60153179325397,"d":"160 m"},"hyperoxie","Narcose",{"v":4.362416107382565,"d":"4.36 "},{"v":95.63758389261744,"d":"95.638"},{"v":42.20876607551273,"d":"42.209 "},{"v":53.42881781710471,"d":"53.429 "},{"v":100,"d":"100 "}]
[29.8999999999999,"PP02 rinçage ou OC > set point, taper OC en F47",{"$nulls":5},{"v":289,"d":"289 m"},null,"OC ou"," rinçage  =",{"v":3.1394999999999897,"d":"3.14"},{"v":11.81049999999996,"d":"11.81"},{"v":0.10500000000000001,"d":"10.50%"},{"v":139.4999999999995,"d":"139 m"},{"v":160.1706644502783,"d":"160 m"},"hyperoxie","Narcose",{"v":4.347826086956537,"d":"4.35 "},{"v":95.65217391304347,"d":"95.652"},{"v":42.21520524653874,"d":"42.215 "},{"v":53.436968666504725,"d":"53.437 "},{"v":100,"d":"100 "}]
[29.9999999999999,"PP02 rinçage ou OC > set point, taper OC en F47",{"$nulls":5},{"v":290,"d":"290 m"},null,"OC ou"," rinçage  =",{"v":3.1499999999999897,"d":"3.15"},{"v":11.84999999999996,"d":"11.85"},{"v":0.10500000000000001,"d":"10.50%"},{"v":139.9999999999995,"d":"140 m"},{"v":160.73979710730265,"d":"161 m"},"hyperoxie","Narcose",{"v":4.333333333333348,"d":"4.33 "},{"v":95.66666666666666,"d":"95.667"},{"v":42.22160148975791,"d":"42.222 "},{"v":53.44506517690874,"d":"53.445 "},{"v":100,"d":"100 "}]
[30.0999999999999,"PP02 rinçage ou OC > set point, taper OC en F47",{"$nulls":5},{"v":291,"d":"291 m"},null,"OC ou"," rinçage  =",{"v":3.160499999999989,"d":"3.16"},{"v":11.889499999999959,"d":"11.89"},{"v":0.105,"d":"10.50%"},{"v":140.49999999999946,"d":"140 m"},{"v":161.308929764327,"d":"161 m"},"hyperoxie","Narcose",{"v":4.3189368770764265,"d":"4.32 "},{"v":95.68106312292358,"d":"95.681"},{"v":42.227955233022136,"d":"42.228 "},{"v":53.45310788990144,"d":"53.453 "},{"v":100,"d":"100 "}]
[30.1999999999999,"PP02 rinçage ou OC > set point, taper OC en F47",{"$nulls":5},{"v":292,"d":"292 m"},null,"OC ou"," rinçage  =",{"v":3.1709999999999896,"d":"3.17"},{"v":11.92899999999996,"d":"11.93"},{"v":0.10500000000000001,"d":"10.50%"},{"v":140.9999999999995,"d":"141 m"},{"v":161.87806242135133,"d":"162 m"},"hyperoxie","Narcose",{"v":4.304635761589418,"d":"4.30 "},{"v":95.69536423841058,"d":"95.695"},{"v":42.234266898516395,"d":"42.234 "},{"v":53.46109733989419,"d":"53.461 "},{"v":100,"d":"100 "}]
[30.2999999999999,"PP02 rinçage ou OC > set point, taper OC en F47",{"$nulls":5},{"v":293,"d":"293 m"},null,"OC ou"," rinçage  =",{"v":3.1814999999999896,"d":"3.18"},{"v":11.96849999999996,"d":"11.97"},{"v":0.105,"d":"10.50%"},{"v":141.4999999999995,"d":"141 m"},{"v":162.4471950783757,"d":"162 m"},"hyperoxie","Narcose",{"v":4.290429042904305,"d":"4.29 "},{"v":95.70957095709569,"d":"95.710"},{"v":42.240536902852284,"d":"42.241 "},{"v":53.46903405424341,"d":"53.469 "},{"v":100,"d":"100 "}]
[30.3999999999999,"PP02 rinçage ou OC > set point, taper OC en F47",{"$nulls":5},{"v":294,"d":"294 m"},null,"OC ou"," rinçage  =",{"v":3.1919999999999895,"d":"3.19"},{"v":12.00799999999996,"d":"12.01"},{"v":0.10500000000000001,"d":"10.50%"},{"v":141.9999999999995,"d":"142 m"},{"v":163.01632773540004,"d":"163 m"},"hyperoxie","Narcose",{"$f":"$Q$45/A344*100","v":{"v":4.276315789473699,"d":"4.28 "}},{"v":95.7236842105263,"d":"95.724"},{"v":42.24676565715965,"d":"42.247 "},{"v":53.47691855336665,"d":"53.477 "},{"v":100,"d":"100 "}]
[30.4999999999999,"PP02 rinçage ou OC > set point, taper OC en F47",{"$nulls":5},{"v":295,"d":"295 m"},null,"OC ou"," rinçage  =",{"v":3.20249999999999,"d":"3.20"},{"v":12.047499999999962,"d":"12.05"},{"v":0.10500000000000001,"d":"10.50%"},{"v":142.49999999999952,"d":"143 m"},{"v":163.58546039242438,"d":"164 m"},"hyperoxie","Narcose",{"v":4.262295081967228,"d":"4.26 "},{"v":95.73770491803278,"d":"95.738"},{"v":42.252953567176476,"d":"42.253 "},{"v":53.4847513508563,"d":"53.485 "},{"v":100,"d":"100 "}]
[30.5999999999999,"PP02 rinçage ou OC > set point, taper OC en F47",{"$nulls":5},{"v":296,"d":"296 m"},null,"OC ou"," rinçage  =",{"v":3.2129999999999894,"d":"3.21"},{"v":12.086999999999959,"d":"12.09"},{"v":0.105,"d":"10.50%"},{"v":142.9999999999995,"d":"143 m"},{"v":164.15459304944872,"d":"164 m"},"hyperoxie","Narcose",{"v":4.24836601307191,"d":"4.25 "},{"v":95.75163398692808,"d":"95.752"},{"v":42.259101033336975,"d":"42.259 "},{"v":53.492532953591116,"d":"53.493 "},{"v":100,"d":"100 "}]
[30.6999999999999,"PP02 rinçage ou OC > set point, taper OC en F47",{"$nulls":5},{"v":297,"d":"297 m"},null,"OC ou"," rinçage  =",{"v":3.2234999999999894,"d":"3.22"},{"v":12.12649999999996,"d":"12.13"},{"v":0.105,"d":"10.50%"},{"v":143.49999999999946,"d":"143 m"},{"v":164.7237257064731,"d":"165 m"},"hyperoxie","Narcose",{"v":4.23452768729643,"d":"4.23 "},{"v":95.76547231270357,"d":"95.765"},{"v":42.265208450858,"d":"42.265 "},{"v":53.500263861845575,"d":"53.500 "},{"v":100,"d":"100 "}]
[30.7999999999999,"PP02 rinçage ou OC > set point, taper OC en F47",{"$nulls":5},{"v":298,"d":"298 m"},null,"OC ou"," rinçage  =",{"v":3.2339999999999893,"d":"3.23"},{"v":12.165999999999961,"d":"12.17"},{"v":0.105,"d":"10.50%"},{"v":143.99999999999952,"d":"144 m"},{"v":165.29285836349743,"d":"165 m"},"hyperoxie","Narcose",{"v":4.220779220779234,"d":"4.22 "},{"v":95.77922077922076,"d":"95.779"},{"v":42.27127620982369,"d":"42.271 "},{"v":53.507944569397075,"d":"53.508 "},{"v":100,"d":"100 "}]
[30.8999999999999,"PP02 rinçage ou OC > set point, taper OC en F47",{"$nulls":5},{"v":299,"d":"299 m"},null,"OC ou"," rinçage  =",{"v":3.2444999999999897,"d":"3.24"},{"v":12.205499999999962,"d":"12.21"},{"v":0.10500000000000001,"d":"10.50%"},{"v":144.4999999999995,"d":"144 m"},{"v":165.86199102052177,"d":"166 m"},"hyperoxie","Narcose",{"v":4.207119741100337,"d":"4.21 "},{"v":95.79288025889966,"d":"95.793"},{"v":42.27730469526856,"d":"42.277 "},{"v":53.5155755636311,"d":"53.516 "},{"v":100,"d":"100 "}]
[30.9999999999999,{"$f":"IF(A350*$E$20/100>$Q$45,\"PP02 rinçage ou OC > set point, taper OC en F47\",\"\")","v":"PP02 rinçage ou OC > set point, taper OC en F47"},{"$nulls":5},{"v":300,"d":"300 m"},null,"OC ou",{"$f":"IF(J350=\"OC ou\",\" rinçage  =\",\"m\")","v":" rinçage  ="},{"v":3.2549999999999897,"d":"3.25"},{"v":12.244999999999962,"d":"12.25"},{"v":0.10500000000000001,"d":"10.50%"},{"v":144.99999999999952,"d":"145 m"},{"v":166.4311236775461,"d":"166 m"},{"$f":"IF(O350>(A350*10)-10,\"Pne>P\",IF(L350>1.4,\"hyperoxie\",\"\"))","v":"hyperoxie"},"Narcose",{"v":4.193548387096787,"d":"4.19 "},{"v":95.80645161290322,"d":"95.806"},{"v":42.28329428725896,"d":"42.283 "},{"v":53.52315732564425,"d":"53.523 "},{"v":99.99999999999999,"d":"100 "}]

{"sheet":"13","index":16,"n_rows":35,"n_cols":16,"rows_kept":35,"merged":[[0,4,0,12],[1,0,1,1],[1,2,1,14],[3,1,3,15],[6,15,7,15],[10,4,10,5],[10,10,10,15],[11,10,11,15],[12,12,12,13],[13,10,13,15],[14,10,14,15],[15,1,15,8],[15,10,15,15],[17,3,18,3],[17,4,18,4],[17,7,18,7],[17,10,17,13],[17,14,17,15],[18,14,19,15],[19,6,19,8],[20,1,20,2],[20,3,21,3],[20,4,21,4],[20,8,21,8],[20,14,20,15],[21,1,21,2],[21,14,21,15],[22,1,23,4],[22,6,23,6],[22,7,23,7],[22,8,23,8],[22,11,22,14],[23,13,23,14],[24,1,24,2],[24,6,24,8],[24,10,24,15],[25,1,25,4],[25,6,25,8],[25,14,25,15],[26,6,26,8],[26,10,26,15],[27,6,27,8]]}
[{"$nulls":4}," AUTONOMIE  et  DISTANCE"]
["JP Couloumy",null," avec 1 ou 2 recycleurs CCR et  (X) bars d'O2"]
[]
[null,"Quelle plongée avec bouteille O2 pleine, ou au 3/4, ou à moitié : avec un recycleur CCR, ou double recycleur CCR  ?"]
[]
[]
[{"$nulls":15},{"$f":"G26","v":{"v":206.20462046204617,"d":"206L"}}]
[]
[{"$nulls":15},"d'oxygène"]
[]
[null,"(lire)",{"$nulls":8},"et une conso moyenne d'O2  de :"]
[null," Température à chaud =",null,null,30,"°","Pression",220,"bars",null,"(métabolisme, vidages masque, yoyos, rinçages, efforts...)"]
[{"$nulls":12},{"v":2,"d":"2.0  L/mn"}]
[null," Température à froid    =",null,null,11,"°","Pression",{"$f":"H12*(273+E14)/(273+E12)","v":{"v":206.2046204620462,"d":"206"}},"bars",null,{"$f":"IF(G23>=2,IF(M24>=130,\"Attention à l'autonomie en chaux\",\"\"),IF(G23=1,IF(M24>50,\"Attention à l'autonomie en chaux\",\"\")))","v":"Attention à l'autonomie en chaux"}]
[]
[null,{"$f":"IF(E18=2,\"Si règle des 1/2, prévoir O2 en plus pour le retour !\",\"\")","v":""},{"$nulls":8},{"$f":"IF(K14=\"Attention à l'autonomie en chaux\",\"(penser au temps retour + temps paliers !)\",\"à une vitesse de :\")","v":"(penser au temps retour + temps paliers !)"}]
[]
[{"$nulls":3},"1 /",3,null,null,{"$f":"E18","v":3},null,null,"palme",{"$nulls":3},"scooter"]
[{"$nulls":10},14,16,18,20,{"v":15,"d":"15 m/mn"}]
[{"$nulls":6},"(Pression consommée)",{"$nulls":3},"m/mn","m/mn","m/mn","m/mn"]
[null,"bouteille O2",null,{"$f":"H14","v":{"v":206.2046204620462,"d":"206"}},"Bars",null," nombre de ",{"$f":"(D21-D25)*G23","v":{"v":68.73487348734872,"d":"69 bars"}},"capacité",null,{"$f":"M24*K19","v":{"v":1443.432343234323,"d":"1443"}},{"$f":"M24*L19","v":{"v":1649.6369636963693,"d":"1650"}},{"$f":"M24*M19","v":{"v":1855.8415841584156,"d":"1856"}},{"$f":"M24*N19","v":{"v":2062.0462046204616,"d":"2062"}},{"$f":"M24*O19","v":{"v":1546.5346534653463,"d":"1547"}}]
[null,"au départ",{"$nulls":4},"bouteilles",{"$nulls":3},"m","m","m","m","m"]
[null,{"$f":"IF(D25<=60,\"Retour limite !\",\"\")","v":""},{"$nulls":4},1,"X",{"v":3,"d":"3 L"},null,null,"Temps aller"]
[{"$nulls":12},{"$f":"G26/M13","v":{"v":103.10231023102308,"d":"103"}},"mn"]
[null,"RETOUR  à",null,{"$f":"IF(E18=2,D21*1/2,IF(E18=3,D21*2/3,IF(E18=4,D21*3/4,IF(E18=5,D21*4/5,\"\"))))","v":{"v":137.46974697469747,"d":"137"}},"Bars",null,"Litres consommés",{"$nulls":3},"DISTANCE  TOTALE  SI  TRAVERSEE"]
[null,{"$f":"IF(G23>1,\"(sur chaque bouteille d'O2)\",\"(sur bouteille d'oxygène !)\")","v":"(sur bouteille d'oxygène !)"},{"$nulls":4},{"$f":"((D21-D25)*I23*G23)","v":{"v":206.20462046204617,"d":"206 L"}},{"$nulls":3},{"$f":"K21*2","v":{"v":2886.864686468646,"d":"2,887 m"}},{"$f":"L21*2","v":{"v":3299.2739273927386,"d":"3,299 m"}},{"$f":"M21*2","v":{"v":3711.683168316831,"d":"3,712 m"}},{"$f":"N21*2","v":{"v":4124.092409240923,"d":"4,124 m"}},{"$f":"O21*2","v":{"v":3093.0693069306926,"d":"3,093 m"}}]
[{"$nulls":10},"Temps total si traversée ( genre Cabouy/ Poumeyssen )"]
[{"$nulls":12},{"$f":"+M24*2","v":{"v":206.20462046204617,"d":"206"}},"mn"]
[]
[{"$nulls":7},"mémo"]
[]
[]
[]
[]
[{"$nulls":6},"ESPACE LIBRE POUR VOS NOTES"]

{"sheet":"14","index":17,"n_rows":128,"n_cols":30,"rows_kept":128,"merged":[[0,24,1,26],[4,0,4,1],[18,32,19,32],[18,34,19,34],[18,38,20,38],[19,8,20,8],[21,13,21,16],[22,8,23,8],[27,27,28,27],[30,8,30,9],[30,13,30,14],[30,15,30,16],[31,1,32,11],[32,13,33,13],[32,14,33,14],[32,15,33,15],[32,16,33,16],[32,17,33,17],[32,25,32,26],[34,1,34,3],[34,5,34,8],[35,1,36,4],[35,6,35,11],[35,13,35,16],[36,5,36,8],[37,10,37,11],[38,2,38,3],[38,13,38,16],[39,1,39,3],[39,5,39,8],[40,1,40,3],[40,5,40,8],[41,1,42,4],[41,6,41,11],[42,5,42,8],[42,13,43,16],[43,5,43,8],[43,10,43,11],[44,13,45,16],[45,1,45,3],[45,5,45,8],[46,1,47,4],[46,6,46,11],[47,5,47,8],[47,13,47,16],[48,10,48,11],[48,13,48,16],[49,2,50,5],[49,6,50,6],[49,7,50,9],[49,10,50,11],[49,13,49,16],[50,13,51,16],[51,3,51,4],[52,1,52,5],[53,10,53,11],[54,2,54,3],[54,4,55,8],[54,9,55,9],[54,10,55,10],[54,11,55,11],[55,2,55,3],[56,10,56,11],[57,12,57,13],[59,6,59,7],[62,5,62,8],[63,2,64,2],[63,3,64,3],[63,5,64,8],[64,14,64,15],[65,1,66,1],[65,2,65,4],[65,5,65,7],[65,8,65,10],[65,11,65,12],[65,13,66,13],[65,14,65,15],[66,5,66,7],[66,8,66,10],[66,11,66,12],[66,14,66,15],[67,7,67,8],[67,11,67,12],[67,15,67,16],[68,7,68,8],[68,11,68,12],[68,15,69,16],[69,7,69,8],[69,11,69,12],[70,7,70,8],[70,11,70,12],[70,15,71,16],[71,7,71,8],[71,11,71,12],[72,7,72,8],[72,11,72,12],[72,15,73,16],[73,7,73,8],[73,11,73,12],[74,7,74,8],[74,11,74,12],[75,7,75,8],[75,11,75,12],[75,15,75,16],[76,7,76,8],[76,11,76,12],[76,15,76,16],[77,7,77,8],[77,11,77,12],[77,15,78,16],[78,7,78,8],[78,11,78,12],[79,7,79,8],[79,11,79,12],[80,7,80,8],[80,11,80,12],[81,7,81,8],[81,11,81,12],[82,7,82,8],[82,11,82,12],[83,7,83,8],[83,11,83,12],[84,7,84,8],[84,11,84,12],[85,7,85,8],[85,11,85,12],[86,7,86,8],[86,11,86,12],[87,7,87,8],[87,11,87,12],[88,7,88,8],[88,11,88,12],[89,7,89,8],[89,11,89,12],[90,7,90,8],[90,11,90,12],[91,7,91,8],[91,11,91,12],[92,7,92,8],[92,11,92,12],[93,7,93,8],[93,11,93,12],[94,7,94,8],[94,11,94,12],[95,7,95,8],[95,11,95,12],[96,7,96,8],[96,11,96,12],[97,7,97,8],[97,11,97,12],[98,7,98,8],[98,11,98,12],[99,7,99,8],[99,11,99,12],[100,7,100,8],[100,11,100,12],[101,7,101,8],[101,11,101,12],[102,7,102,8],[102,11,102,12],[103,7,103,8],[103,11,103,12],[104,7,104,8],[104,11,104,12],[105,7,105,8],[105,11,105,12],[106,7,106,8],[106,11,106,12],[107,7,107,8],[107,11,107,12],[108,7,108,8],[108,11,108,12],[109,7,109,8],[109,11,109,12],[110,7,110,8],[110,11,110,12],[111,7,111,8],[111,11,111,12],[112,7,112,8],[112,11,112,12],[113,7,113,8],[113,11,113,12],[114,7,114,8],[114,11,114,12],[115,7,115,8],[115,11,115,12],[116,7,116,8],[116,11,116,12],[117,7,117,8],[117,11,117,12],[118,7,118,8],[118,11,118,12],[119,7,119,8],[119,11,119,12],[120,7,120,8],[120,11,120,12],[121,7,121,8],[121,11,121,12],[122,7,122,8],[122,11,122,12],[122,15,123,16],[123,7,123,8],[123,11,123,12],[124,7,124,8],[124,11,124,12],[124,15,125,16],[125,7,125,8],[125,11,125,12],[126,7,126,8],[126,11,126,12],[126,15,127,16],[127,7,127,8],[127,11,127,12]]}
[]
[]
[]
[]
["JP Couloumy"]
[]
[{"$nulls":22},"temps 1 rinçage =",{"v":40,"d":"40.0 "},"secondes"]
[{"$nulls":22},"1 rinçage =",{"$f":"N37*V13*2","v":108},"litres"]
[]
[{"$nulls":21},"1  inspi =",null,6,"secondes"]
[]
[null,"Panne d'affichage, ou panne d'injection d'O2, on peut respirer dans la boucle sous certaines conditions :",{"$nulls":19},"pression "]
[null,"En respirant le diluant du recycleur ou celui du bail out raccordé à sa place. Le pourcentage d'O2 va rapidement diminuer jusqu'à atteindre une",{"$nulls":19},{"$f":"1+(N45/10)","v":9}]
[null,"valeur non viable (hypoxie). Le volume de la boucle devrait lui aussi diminuer (du fait de l'O2 consommé) mais sera compensé par l'ADV ou manuellement. "]
[null,"On devra donc, avant d'atteindre cette valeur : vidanger (rincer, flusher) la totalité du gaz restant dans la boucle et le remplacer par du gaz \"frais\". "]
[null,"Puis recommencer à respirer dans la boucle, puis revidanger etc…"]
[null,"Le nombre de respirations entre chaque rinçage sera fonction du mélange, de la profondeur, de la consommation personnelle d'O2, du volume de la boucle"]
[null,"et du stress !",{"$nulls":19},"1  inspi =",null,"O2 consommé=",{"$f":"N40/60*X10","v":0.1},"L","soit en",{"$f":"X10","v":6},"secondes"]
[{"$nulls":21},"X  inspi =",null,"O2 consommé ",{"$f":"Y18*N51","v":2},"L","soit",{"$f":"X10*N51","v":120},"secondes"]
["Alarmes dans ce tableau :",{"$nulls":7},"(lire)",{"$nulls":12},"1 cycle complet ( in/ex + 1 rinçage )=",null,null,{"$f":"Y19+X8","v":110},"L","soit",{"$f":"AB19+X7","v":{"v":160,"d":"160.0 "}},"secondes"]
[null," -Hyperoxie (si PPO2 >1,6)"]
[null," -Hypoxie proche (si PPO2 < 0,27)",{"$nulls":11},"Paramètres de la plongée :",{"$nulls":8},"L de la boucle X pression (avant cycles)",null,null,{"$f":"N37*V13","v":54},"volume =",{"$f":"Z22/V13","v":6},"(normolitre)"]
[null," -Hypoxie (si PPO2 < 0,19)",{"$nulls":6},"(lire)",{"$nulls":13},"L de la boucle X pression (après cycles)",null,null,{"$f":"Z22-Y19","v":52},"volume =",{"$f":"Z23/V13","v":{"v":5.777777777777778,"d":"5.78"}},"(normolitre)"]
[null," -Mélange surazoté, paliers rallongés (si % N2 > 79,5%)",{"$nulls":11}," ---1 inspiration/expiration = 6 secondes"]
[null," -Mélange surazoté INTERDIT (si % N2 > 81,5%)",{"$nulls":11},"   soit 10 par minute",{"$nulls":7},"L d'O2 avant les cycles (%)",null,{"$f":"J37*V13*N33/100","v":5.4},"L d'Hé =",{"$f":"Z22*O33/100","v":27},"Lde N2 =",{"$f":"Z22*P33/100","v":21.6},"total =",{"$f":"X25+Z25+AB25","v":{"v":54,"d":"54.00"}}]
[null," -% O2 du diluant trop élevé pour cette profondeur (en dessous de 43 m si  PPO2 > 1,47)",{"$nulls":11}," ---Un rinçage diluant  =",null,null,"40 secondes",{"$nulls":4},"L d'O2 après les cycles (%)",null,{"$f":"X25-Y19","v":3.4000000000000004},"L d'Hé après",{"$f":"Z25","v":27},"Lde N2 après",{"$f":"AB25","v":21.6},"total =",{"$f":"X26+Z26+AB26","v":{"v":52,"d":"52.00"}}]
[null," -Pne élevée (si avec diluant trimix > à 35m) ",{"$nulls":11},"   soit 2 vidages complets de la boucle",{"$nulls":8},"% O2 après =",{"$f":"X26/Z23*100","v":{"v":6.538461538461539,"d":"6.54"}},"% Hè après",{"$f":"Z25/Z23*100","v":{"v":51.92307692307693,"d":"51.92"}},"% N2 après",{"$f":"AB26/Z23*100","v":{"v":41.53846153846154,"d":"41.54"}},"total =",{"$f":"X27+Z27+AB27","v":{"v":100,"d":"100.00"}}]
[{"$nulls":13},"   soit : ",{"$f":"J37*V13*2","v":108},"litres expulsés",{"$nulls":11},"OK"]
[null,"Tableau pour parcours horizontal   (si différentes profondeurs, faire par tranche de profondeur)",{"$nulls":20},"PP O2 =",{"$f":"(V13*X27)/100","v":{"v":0.5884615384615386,"d":"0.59"}}]
[{"$nulls":4},"         (si différents diluants, faire par tranche diluant / profondeur)",{"$nulls":9},"A programmer :"]
[null,null," Fermer la bouteille d'oxygène",{"$nulls":5},"PROFONDEUR   =",null,{"$f":"N45","v":{"v":80,"d":"80 m"}},null,null,"diluant",null,{"$f":"IF(N33+O33=21,\"(AIR)\",IF(O33=0,\"(nitrox)\",IF(P33=0,\"(héliox)\",IF(N33+O33+P33=100,\"(trimix)\"))))","v":"(trimix)"}]
[null,{"$f":"IF(N45>43,IF(E35>1.47,\"%O2 du diluant trop élevé pour cette profondeur !\",\"\"),\"\")","v":""},{"$nulls":11},"%O2","%Hé","%N2"]
[{"$nulls":13},10,50,{"$f":"100-(N33+O33)","v":40},{"$f":"IF(P33<0,\"erreur !\",IF(N33=0,\"erreur !\",\"\"))","v":""},{"$f":"IF(Q33=\"sousox\",\"?\",\"\")","v":""},{"$nulls":3},"Temps retour en secondes =",null,{"$f":"C56*60","v":600},"secondes","(nombre de rinçages)"]
[null,null," Faire un rinçage complet",{"$nulls":6},"%O2","%Hé","%N2",{"$nulls":9},"Nombre de cycles in/ex + 1 rinçage retour     =",{"$nulls":3},{"$f":"ROUNDDOWN(1/AB20*X33,0)","v":{"v":3,"d":"3.000 "}},"cycles complets"]
[null,"PP O2 dans la boucle   =",null,null,{"$f":"V13*J35/100","v":{"v":0.9,"d":"0.90"}},"            Mélange dans la boucle    =",{"$nulls":3},{"$f":"N33","v":{"v":10,"d":"10.0 "}},{"$f":"O33","v":{"v":50,"d":"50.0 "}},{"$f":"P33","v":{"v":40,"d":"40.0 "}},{"$nulls":9},"litres retour",{"$f":"(Y20*Z34)","v":{"v":330,"d":"330.0 "}}]
[null,{"$f":"IF(E35<0.19,\"Hypoxie !\",IF(E35<0.27,\"Hypoxie proche !\",IF(E35>1.6,\"hyperoxie !\",\"\")))","v":""},{"$nulls":4},{"$f":"IF(L35>81.5,\"DANGER : mélange surazoté INTERDIT\",IF(L35>79.5,\"Danger : mélange surazoté ! Paliers rallongés !\",\"\"))","v":""},{"$nulls":6},"Litres variables de la boucle"]
[{"$nulls":5},"volume variable de la boucle   = ",{"$nulls":3},{"$f":"N37","v":{"v":6,"d":"6 L"}},"Pne =",{"$f":"IF(((10*V13*(L35)%)/0.79)-(7.9/0.79)<=0,0,((10*V13*(L35)%)/0.79)-(7.9/0.79))","v":{"v":35.56962025316456,"d":"36 m"}},null,6,"litres",{"$nulls":6},"compensation de la boucle au diluant",null,null,{"$f":"(N37-J43)","v":{"v":0.22222222222222232,"d":"0.22"}},"    L      de",{"$f":"N33","v":10},{"$f":"O33","v":50},{"$f":"P33","v":40}]
[{"$nulls":10},{"$f":"IF(P31=\"(AIR)\",\"\",IF(L37>35,\"Pne élevée !\",\"\"))","v":"Pne élevée !"},{"$nulls":10},"soit en litres à la pression :",null,null,{"$f":"Y37*V13","v":2.000000000000001},"    L      de","\"\"","\"\"","\"\""]
[null,null,"Après  avoir  fait",null,{"$f":"N51","v":20},{"$f":"IF(E39<2,\"inspiration / expiration  dans la boucle\",\"inspirations / expirations  dans la boucle\")","v":"inspirations / expirations  dans la boucle"},{"$nulls":7},"conso moyenne d'O2 par minute"]
[null,"PP O2 dans la boucle   =",null,null,{"$f":"$V$13*$J$40/100","v":{"v":0.5884615384615386,"d":"0.59 "}},"            Mélange dans la boucle    =",{"$nulls":3},{"$f":"W46","v":{"v":6.538461538461539,"d":"6.54 "}},{"$f":"W47","v":{"v":51.92307692307693,"d":"51.92 "}},{"$f":"W48","v":{"v":41.53846153846154,"d":"41.54 "}},null,1,"L /mn",{"$nulls":6},"L O2 ajoutés",{"$f":"AA37/100*Y38","v":0.2000000000000001},"       +","restant",{"$f":"W40+X26","v":3.6000000000000005},"nouveaux"]
[null,"(Si rajout de diluant)   =       ",null,null,{"$f":"$V$13*$J$41/100","v":{"v":0.6000000000000001,"d":"0.60 "}},"(Si rajout de diluant)   =",{"$nulls":3},{"$f":"Z46","v":{"v":6.666666666666668,"d":"6.67 "}},{"$f":"Z47","v":{"v":51.85185185185185,"d":"51.85 "}},{"$f":"Z48","v":{"v":41.48148148148149,"d":"41.48 "}}]
[null,{"$f":"IF(E40<0.19,\"Hypoxie !\",IF(E40<0.27,\"Hypoxie proche !\",IF(E40>1.6,\"hyperoxie !\",\"\")))","v":""},{"$nulls":4},{"$f":"IF(L40>81.5,\"DANGER : mélange surazoté INTERDIT\",IF(L40>79.5,\"Danger : mélange surazoté ! Paliers rallongés !\",\"\"))","v":""},{"$nulls":14},"L Hé ajoutés",{"$f":"AB37/100*Y38","v":1.0000000000000004},"       +","restant",{"$f":"W42+Z26","v":28},"litres"]
[{"$nulls":5},"volume variable de la boucle   = ",{"$nulls":3},{"$f":"Z23/V13","v":{"v":5.777777777777778,"d":"5.78 L"}},"Pne =",{"$f":"IF(((10*V13*(L40)%)/0.79)-(7.9/0.79)<=0,0,((10*V13*(L40)%)/0.79)-(7.9/0.79))","v":{"v":37.32229795520935,"d":"37 m"}},null,"Profondeur",{"$nulls":7},"L N2 ajoutés",{"$f":"AC37/100*Y38","v":0.8000000000000004},"       +","restant",{"$f":"W43+AB26","v":22.400000000000002},"après "]
[{"$nulls":5},"(Si rajout de diluant)   =     ",{"$nulls":3},{"$f":"Y37+AB23","v":{"v":6,"d":"6.00 L"}},{"$f":"IF(P31=\"(AIR)\",\"\",IF(L43>35,\"Pne élevée !\",\"\"))","v":"Pne élevée !"},{"$nulls":10},"total",{"$f":"W40+W42+W43","v":2.000000000000001},null,"total",{"$f":"Z40+Z42+Z43","v":54},"complément"]
[null,null,"Faire un nouveau rinçage au diluant",{"$nulls":10},{"v":80,"d":"80 mètres"}]
[null,"PP O2 dans la boucle   =",null,null,{"$f":"V13*J46/100","v":{"v":0.9,"d":"0.90"}},"            Mélange dans la boucle    =",{"$nulls":3},{"$f":"N33","v":{"v":10,"d":"10.0 "}},{"$f":"O33","v":{"v":50,"d":"50.0 "}},{"$f":"P33","v":{"v":40,"d":"40.0 "}},{"$nulls":9},"% O2 ",{"$f":"X26/Z23*100","v":{"v":6.538461538461539,"d":"6.54"}},null,"% O2",{"$f":"Z40/Z44*100","v":{"v":6.666666666666668,"d":"6.67"}}]
[null,{"$f":"IF(E35<0.19,\"Hypoxie !\",IF(E35<0.27,\"Hypoxie proche !\",IF(E35>1.6,\"hyperoxie !\",\"\")))","v":""},{"$nulls":4},{"$f":"IF(L46>81.5,\"DANGER : mélange surazoté INTERDIT\",IF(L46>79.5,\"Danger : mélange surazoté ! Paliers rallongés !\",\"\"))","v":""},{"$nulls":12},"avant complèment",null,"% Hè ",{"$f":"Z25/Z23*100","v":{"v":51.92307692307693,"d":"51.92"}},"après","% Hé",{"$f":"Z42/Z44*100","v":51.85185185185185}]
[{"$nulls":5},"volume variable de la boucle   = ",{"$nulls":3},{"$f":"N37","v":{"v":6,"d":"6 L"}},"Pne =",{"$f":"IF(((10*V13*(L46)%)/0.79)-(7.9/0.79)<=0,0,((10*V13*(L46)%)/0.79)-(7.9/0.79))","v":{"v":35.56962025316456,"d":"36 m"}},null,"nombre",{"$nulls":5},"diluant",null,"% N2",{"$f":"AB26/Z23*100","v":{"v":41.53846153846154,"d":"41.54"}},null,"% N2",{"$f":"Z43/Z44*100","v":{"v":41.48148148148149,"d":"41.481"}}]
[{"$nulls":10},{"$f":"IF(P31=\"(AIR)\",\"\",IF(L37>35,\"Pne élevée !\",\"\"))","v":"Pne élevée !"},null,null,"d'inspirations / expirations ",{"$nulls":7},"total =",{"$f":"W46+W47+W48","v":{"v":100,"d":"100.00"}},null,"total",{"$f":"Z46+Z47+Z48","v":100}]
[null,null,"Renouveler  les  cycles complets  :",{"$nulls":3},{"$f":"N51","v":20},{"$f":"IF(G50<2,\"inspiration  / expiration\",\"inspirations  / expirations\")","v":"inspirations  / expirations"},null,null," + 1 rinçage",null,null,"entre chaque rinçage"]
[{"$nulls":13},{"v":20,"d":"20  inspi/expi"},{"$nulls":7},"PP 2",{"$f":"Z46*V13/100","v":0.6000000000000001}]
[null,"1 rinçage =",{"$f":"O28","v":{"v":108,"d":"108 L"}},"cycles complets   =",null,{"$f":"Z34","v":{"v":3,"d":"3cycles"}}]
[null,"Litres de diluant nécessaire pour le retour",{"$nulls":4},{"$f":"O28+W35","v":{"v":438,"d":"438 L"}},"  (  pour",{"$f":"(C56)","v":{"v":10,"d":"10 mn"}},"à  la profondeur de",null,{"$f":"N45","v":{"v":80,"d":"80 m )"}}]
[{"$nulls":9},"pression","bouteille"]
[null,null,"temps retour ",null,"Bouteille  nécessaire",{"$nulls":4},{"v":60,"d":"60 B"},{"$f":"IF(G53/J55<2,\"2 L\",IF(G53/J55<3,\"3 L\",IF(G53/J55<4,\"4 L\",IF(G53/J55<5,\"5 L\",IF(G53/J55<6,\"6 L\",IF(G53/J55<7,\"7 L\",IF(G53/J55<8,\"8 L\",\"\")))))))","v":"8 L"},{"$f":"IF(G53/J55<8,\"\",IF(G53/J55<9,\"9 L\",IF(G53/J55<10,\"10 L\",IF(G53/J55<11,\"11 L\",IF(G53/J55<12,\"12 L\",IF(G53/J55<13,\"13 L\",IF(G53/J55<15,\"15 L\",IF(G53/J55<18,\"18 L\",\"!\"))))))))","v":""}]
[null,null,{"v":10,"d":"10 mn"}]
[{"$nulls":9},"pression","bouteille"]
[null,"          Comparaison avec bail out (avec 1/3 de sécu)",{"$nulls":4},{"$f":"(25*V13*C56)+((25*V13*C56)/3)","v":{"v":3000,"d":"3000 L"}},null,null,{"v":200,"d":"200 B"},{"$f":"IF(G58/J58<2,\"2 L\",IF(G58/J58<3,\"3 L\",IF(G58/J58<4,\"4 L\",IF(G58/J58<5,\"5 L\",IF(G58/J58<6,\"6 L\",IF(G58/J58<7,\"7 L\",IF(G58/J58<8,\"8 L\",\"\")))))))","v":""},{"$f":"IF(G58/J58<8,\"\",IF(G58/J58<9,\"9 L\",IF(G58/J58<10,\"10 L\",IF(G58/J58<11,\"11 L\",IF(G58/J58<12,\"12 L\",IF(G58/J58<13,\"13 L\",IF(G58/J58<15,\"15 L\",IF(G58/J58<18,\"18 L\",\"\"))))))))","v":"18 L"},{"$f":"IF(G58/J58<18,\"\",IF(G58/J58<20,\"20 L\",IF(G58/J58<24,\"2x12 L\",IF(G58/J58<30,\"2x15 L\",IF(G58/J58<36,\"2x18 L\",IF(G58/J58<40,\"2x20 L\",\"!\"))))))","v":""}]
[]
[{"$nulls":6},"(lire)"]
[]
[]
[null,null," boucle",{"v":5,"d":"5 L"},null,"TABLEAU  RECAPITULATIF"]
[null,null,"O2 / mn",{"v":1.4,"d":"1.4 L/mn"},null,"(libre et non automatique)"]
[{"$nulls":14},"Total litres"]
[null,"Profondeur"," % Diluant",null,null,"Nombre de cycles",null,null,"PPO2 après",null,null,"Temps à",null,"Litres","(approximatif)"]
[null,null,"O2","Hé","N2","avant prochain rinçage",null,null,"une série d'inspi / expi",null,null," profondeur",null,null,{"$f":"SUM(N68:N128)","v":669}]
[null,"0m",null,null,{"$f":"IF(C68=0,\"\",100-(C68+D68))","v":""},null,null,{"$f":"IF(J68=0,\"\",IF(J68<0.19,\"hypoxie\",IF(J68<0.27,\"hypoxie proche\",\"\")))","v":""},{"$nulls":7},"bouteille diluant"]
[null,5,8.5,58,{"$f":"IF(C69=0,\"\",100-(C69+D69))","v":33.5},null,0,{"$f":"IF(J69=0,\"\",IF(J69<0.19,\"hypoxie\",IF(J69<0.27,\"hypoxie proche\",\"\")))","v":"hypoxie"},null,0.15,{"$nulls":5},{"v":200,"d":"200 b"}]
[null,"10m",null,null,"",null,null,""]
[null,15,8.5,58,33.5,null,0,"hypoxie proche",null,0.21,{"$nulls":5},{"$f":"IF(O67/P69<2,\"2 L\",IF(O67/P69<3,\"3 L\",IF(O67/P69<4,\"4 L\",IF(O67/P69<5,\"5 L\",IF(O67/P69<6,\"6 L\",IF(O67/P69<7,\"7 L\",IF(O67/P69<8,\"8 L\",\"\")))))))","v":"4 L"}]
[null,"20m",null,null,"",null,null,""]
[null,25,8.5,58,33.5,null,3,"hypoxie proche",null,0.22,{"$nulls":5},{"$f":"IF(O67/P69<8,\"\",IF(O67/P69<9,\"9 L\",IF(O67/P69<10,\"10 L\",IF(O67/P69<11,\"11 L\",IF(O67/P69<12,\"12 L\",IF(O67/P69<13,\"13 L\",IF(O67/P69<15,\"15 L\",IF(O67/P69<18,\"18 L\",\"\"))))))))","v":""}]
[null,"30m",null,null,"",null,null,""]
[null,35,8.5,58,33.5,null,5,"hypoxie proche",null,0.25]
[null,"40m",null,null,"",null,null,""]
[null,45,8.5,58,33.5,null,8,"hypoxie proche",null,0.25,null,1,null,66]
[null,"50m",null,null,"",null,null,""]
[null,55,8.5,58,33.5,null,11,"hypoxie proche",null,0.26,null,1,null,78]
[null,"60m",null,null,"",null,null,""]
[null,65,8.5,58,33.5,null,14,"hypoxie proche",null,0.26,null,1,null,90]
[null,"70m",null,null,"",null,null,""]
[null,75,8.5,58,33.5,null,17,"hypoxie proche",null,0.26,null,10,null,435]
[null,"80m",null,null,"",null,null,""]
[null,85,null,null,"",null,null,""]
[null,"90m",null,null,"",null,null,""]
[null,95,null,null,"",null,null,""]
[null,"100m",null,null,"",null,null,""]
[null,105,null,null,"",null,null,""]
[null,"110m",null,null,"",null,null,""]
[null,115,null,null,"",null,null,""]
[null,"120m",8.5,58,33.5,null,30,"",null,0.28]
[null,125,null,null,"",null,null,""]
[null,"130m",null,null,"",null,null,""]
[null,135,null,null,"",null,null,""]
[null,"140m",null,null,"",null,null,""]
[null,145,null,null,"",null,null,""]
[null,"150m",8.5,58,33.5,null,40,"hypoxie proche",null,0.26]
[null,155,null,null,"",null,null,""]
[null,"160m",null,null,"",null,null,""]
[null,165,null,null,"",null,null,""]
[null,"170m",null,null,"",null,null,""]
[null,175,null,null,"",null,null,""]
[null,"180m",null,null,"",null,null,""]
[null,185,null,null,"",null,null,""]
[null,"190m",null,null,"",null,null,""]
[null,195,null,null,"",null,null,""]
[null,"200m",null,null,"",null,null,""]
[null,205,null,null,"",null,null,""]
[null,"210m",null,null,"",null,null,""]
[null,215,null,null,"",null,null,""]
[null,"220m",null,null,"",null,null,""]
[null,225,null,null,"",null,null,""]
[null,"230m",null,null,"",null,null,""]
[null,235,null,null,"",null,null,""]
[null,"240m",null,null,"",null,null,""]
[null,245,null,null,"",null,null,""]
[null,"250m",null,null,"",null,null,""]
[null,255,null,null,"",null,null,""]
[null,"260m",null,null,"",null,null,""]
[null,265,null,null,"",null,null,""]
[null,"270m",null,null,"",null,null,""]
[null,275,null,null,"",null,null,"",{"$nulls":7},"En construction"]
[null,"280m",null,null,"",null,null,""]
[null,285,null,null,"",null,null,""]
[null,"290m",null,null,"",null,null,""]
[null,295,null,null,"",null,null,""]
[null,"300m",null,null,"",null,null,""]

{"sheet":"15","index":18,"n_rows":37,"n_cols":39,"rows_kept":37,"merged":[[1,1,3,7],[6,34,7,37],[12,4,13,4],[14,2,15,6],[16,4,16,6],[20,34,20,37],[21,36,21,37],[22,2,22,6]]}
["JP Couloumy"]
[null,"Degré de pollution dans une cloche de déco, si respiration  de l'air de cette cloche"]
[]
[]
[{"$nulls":4},"(lire)"]
[null,null,"Volume de la cloche"]
[null,null,{"v":1000,"d":"1000L "},{"$nulls":3},"Temps passé",{"$nulls":25},"volume plongeur(s)",null,"Composition air neuf cloche"]
[{"$nulls":4},"poids plongeur",null,"dans la cloche",{"$nulls":25},{"$f":"(E9+20)*E12","v":90}]
[null,null,"Profondeur",null,{"v":70,"d":"70kg "},null,0,{"$nulls":28},"% N2","% CO2","Total"]
[null,null,"bas de la cloche",{"$nulls":32},{"$f":"100-(C14+AK10)","v":78.97},0.03,{"$f":"C14+AJ10+AK10","v":100}]
[null,null,{"v":9,"d":"9m"},null,"nombre plongeurs",null,"Conso O2 / mn"]
[{"$nulls":4},1,null,"(métabolisme)",{"$nulls":25},"Pression Gaz cloche",null,"L. O2 cloche","L. N2 cloche","L. CO2 cloche","Total ="]
[null,null,"% O2 dans la cloche",null,{"$f":"IF(E22<=0.025,\"\", IF(E22<0.03,\"CO2     :-(\",\"DANGER\"))","v":""},null,{"v":0.8,"d":"0.8 L/mn"},{"$nulls":25},{"$f":"1+(C11/10)","v":1.9},null,{"$f":"AG17*C14/100","v":363.09},{"$f":"(AG17*(100-C14)/100)-AK13","v":{"v":1365.3913,"d":"1365.39"}},{"$f":"0.03/100*AG17","v":{"v":0.5186999999999999,"d":"0.52"}},{"$f":"AI13+AJ13+AK13","v":1729}]
[null,null,{"v":21,"d":"21% "},{"$nulls":29},"Volume cloche"]
[null,null,{"$f":"IF(E22<=0.03,\"\",IF(E22<0.055,\"début d'essoufflement\",IF(E22<0.1,\"essoufflement grave\",IF(E22<0.12,\"délires etc..., très grave\",IF(E22<0.18,\"perte de connaissance, convulsions\",IF(E22>0.18,\"MORT\",\"\"))))))","v":""},{"$nulls":29},"à profondeur",null,"PP O2","PP N2 ","PP CO2","Total="]
[{"$nulls":32},"avec plongeur",null,{"$f":"AG13*C14/100","v":{"v":0.39899999999999997,"d":"0.40"}},{"$f":"(AG13*(100-C14))/100","v":{"v":1.501,"d":"1.50"}},{"$f":"AK13/AG17*100","v":0.03},{"$f":"AI16+AJ16","v":1.9}]
[null,null,"Après",{"$f":"G9","v":0},"mn      passées  dans la cloche",{"$nulls":27},{"$f":"((C7-AG8)*AG13)","v":1729}]
[null,null,"% O2","% N2","% CO2 ","% déchets","Total"]
[null,null,{"$f":"AI24/AM24*100","v":{"v":21,"d":"21.00 %"}},{"$f":"AJ24/AM24*100","v":{"v":78.97,"d":"78.97 %"}},{"$f":"AK24/AM24*100","v":{"v":0.03,"d":"00.03 %"}},{"$f":"AL24/AM24*100","v":{"v":0,"d":"0.00% "}},{"$f":"C19+D19+E19+F19","v":{"v":100,"d":"100 %"}}]
[]
[null,null,"PP O2","PP N2","PP CO2","PP déchets","Total",{"$nulls":27},"Composition air  de la  cloche"]
[null,null,{"$f":"AG13*C19/100","v":{"v":0.39899999999999997,"d":"0.40b "}},{"$f":"AG13*D19/100","v":{"v":1.5004299999999997,"d":"1.50b "}},{"$f":"AG13*E19/100","v":{"v":0.00057,"d":"0.001b "}},{"$f":"AG13*F19/100","v":{"v":0,"d":"0.000b "}},{"$f":"C22+D22+E22+F22","v":{"v":1.8999999999999997,"d":"1.9b "}},{"$nulls":27},"après",{"$f":"G9","v":0},"mn    passées à l'intérieur"]
[null,null,{"$f":"IF(C22<0.19,\"Manque d'oxygène, risque d'hypoxie !\",\"\")","v":""},{"$nulls":29},"O2 consommé",null,"L. d'O2 restant","L. de N2 restant","L. de CO2 restant","L. déchets ","Total restant"]
[{"$nulls":32},{"$f":"G13*G9*E12","v":0},null,{"$f":"AI13-AG24","v":363.09},{"$f":"AJ13","v":{"v":1365.3913,"d":"1365.39"}},{"$f":"AG28+AK13","v":{"v":0.5186999999999999,"d":"0.52"}},{"$f":"AL13-(AI24+AJ24+AK24)","v":0},{"$f":"AI24+AJ24+AK24+AL24","v":1729}]
[]
[]
[{"$nulls":32},"Litres de CO2 rejeté",{"$nulls":4},"% déchets ","% total"]
[{"$nulls":32},{"$f":"(0.8*AG24)","v":0}]
[]
[{"$nulls":37},"PP déchets","PP totale"]
[]
[]
[{"$nulls":33},"PPco2 > 0,03 = début d'essoufflement"]
[{"$nulls":33},"PPco2 > 0,05= essoufflement grave",{"$nulls":3},"valeur  maxi professionnelle = 0,5 %"]
[{"$nulls":33},"PPco2 > 0,07= essoufflement très grave",{"$nulls":3},"valeur maxi à 1,5 % = 10 mn"]
[{"$nulls":33},"PPco2 > 0,1= délire très grave"]
[{"$nulls":33},"PPco2 > 0,12= perte de connaissance, convultions"]

{"sheet":"16","index":19,"n_rows":43,"n_cols":43,"rows_kept":43,"merged":[[0,6,0,13],[1,0,1,2],[1,6,1,13],[3,0,3,5],[4,0,4,5],[5,0,5,5],[5,15,6,19],[6,4,8,4],[10,14,14,14],[11,2,12,2],[11,3,12,3],[11,4,12,4],[15,14,15,20],[19,2,20,4],[24,2,25,2],[24,3,25,3],[24,4,25,4],[26,2,27,4],[28,2,29,3],[28,4,29,4],[29,14,33,14]]}
[{"$nulls":6},"Plongée YOYO"]
["JP Couloumy",{"$nulls":5},"Entrer le trajet aller, le retour est calculé automatiquement"]
[]
["Consommation théorique d'une",{"$nulls":5},"1ère",null,"2ème",null,"3ème",null,"4ème",{"$nulls":29},"les 3 ap"]
["combinaison, stab ou recycleur CCR",{"$nulls":5},"descente","1ère","descente","2ème","descente","3ème","descente","4ème",{"$nulls":26},"PA","Prof"," * PA"]
["(séparément ou ensemble)",{"$nulls":6},"montée",null,"montée",null,"montée",null,"montée",null,"Exemple :",{"$nulls":16},"d","m","d","m","d","m","d","m"]
[{"$nulls":6},"(1)","(2)","(3)","(4)","(5)","(6)","(7)","(8)"]
[{"$nulls":3},"Lire",null,"0m",".",{"$nulls":7},"   0m",{"$nulls":17},{"$f":"IF(G8=1,$AQ8,\"\")","v":""},{"$f":"IF(H8=2,$AQ8,\"\")","v":""},{"$f":"IF(I8=3,$AQ8,\"\")","v":""},{"$f":"IF(J8=4,$AQ8,\"\")","v":""},{"$f":"IF(K8=5,$AQ8,\"\")","v":""},{"$f":"IF(L8=6,$AQ8,\"\")","v":""},{"$f":"IF(M8=7,$AQ8,\"\")","v":""},{"$f":"IF(N8=8,$AQ8,\"\")","v":""},{"$f":"(AP8+10)/10","v":1},0,{"$f":"($C$12+$D$12+$E$12)*AO8","v":19}]
[{"$nulls":5},"10m",{"$nulls":10},"Aller",{"$nulls":15},{"$f":"IF(G9=1,$AQ9,\"\")","v":""},{"$f":"IF(H9=2,$AQ9,\"\")","v":""},{"$f":"IF(I9=3,$AQ9,\"\")","v":""},{"$f":"IF(J9=4,$AQ9,\"\")","v":""},{"$f":"IF(K9=5,$AQ9,\"\")","v":""},{"$f":"IF(L9=6,$AQ9,\"\")","v":""},{"$f":"IF(M9=7,$AQ9,\"\")","v":""},{"$f":"IF(N9=8,$AQ9,\"\")","v":""},{"$f":"(AP9+10)/10","v":2},10,38]
[null,null,"volume","volume","volume","20m",null,".",{"$nulls":11},"20m",{"$nulls":12},"","","","","","","","",{"$f":"(AP10+10)/10","v":3},20,57]
[null,null,"combi","stab","recycleur","30m",".",".",{"$nulls":6},{"$f":"IF(C20=\"1 profondeur par descente !\",\"!\",IF(C20=\"1 profondeur par montée !\",\"!\",\"\"))","v":""},{"$nulls":17},"","","","","","","","",{"$f":"(AP11+10)/10","v":4},30,76]
[null,null,8,1,10,"40m",null,".",{"$nulls":9},"44m",null,null,"Retour",{"$nulls":6},"rinçage","vidage","rinçage",null,null,"","","","","","","","",5,40,95]
[{"$nulls":5},"50m",null,2,{"$nulls":19},"combi à :","masque","recycleur à :",null,null,"",114,"","","","","","",6,50,114]
[{"$nulls":5},"60m",null,".",{"$nulls":8},"57m",{"$nulls":15},"","","","","","","","",7,60,133]
[null,null,"perte gaz","vidage","rinçage","70m",".",{"$nulls":11},"88m",{"$nulls":8},{"$f":"IF(C17=0,0,(C17/10+1)*$C$12)","v":0},{"$f":"IF(D17=0,0,(D17/10+1)*1)","v":0},{"$f":"IF(E17=0,0,(E17/10+1)*($E$12-1.5)*2)","v":0},null,null,"","","","","","","","",8,70,152]
[null,null,"combi","masque","diluant CCR","80m",1,null,".",{"$nulls":18},{"$f":"IF(C18=0,0,(C18/10+1)*$C$12)","v":0},{"$f":"IF(D18=0,0,(D18/10+1)*1)","v":0},{"$f":"IF(E18=0,0,(E18/10+1)*($E$12-1.5)*2)","v":0},null,null,171,"","","","","","","",9,80,171]
[null,"1ère",0,0,0,"90m",{"$nulls":10},"montée",null,"montée",{"$nulls":8},{"$f":"IF(C19=0,0,(C19/10+1)*$C$12)","v":0},{"$f":"IF(D19=0,0,(D19/10+1)*1)","v":0},{"$f":"IF(E19=0,0,(E19/10+1)*($E$12-1.5)*2)","v":0},null,null,"","","","","","","","",10,90,190]
[null,"2ème",0,0,0,"100m",null,null,3,{"$nulls":6},"(1)","(2)","(3)","(4)","(5)",{"$nulls":6},"aller",{"$f":"SUM(AG42:AN42)","v":266},"L",{"$f":"1/C25*AB18","v":88.66666666666666},"B",null,"","",209,"","","","","",11,100,209]
[null,"3ème",0,0,0,"110m",".",{"$nulls":7},"0m",{"$nulls":11},"retour",{"$f":"SUM(AG43:AN43)","v":57},"L",{"$f":"1/C25*AB19","v":{"v":19,"d":"19.0"}},"B",null,"","","","","","","","",12,110,228]
[null,null,{"$f":"IF(G39>1,\"1 profondeur par descente !\",IF(H39>2,\"1 profondeur par montée !\",IF(I39>3,\"1 profondeur par descente !\",IF(J39>4,\"1 profondeur par montée !\",IF(K39>5,\"1 profondeur par descente !\",IF(L39>6,\"1 profondeur par montée !\",IF(M39>7,\"1 profondeur par descente !\",IF(N39>8,\"1 profondeur par montée !\",\"\"))))))))","v":""},null,null,"120m",null,".",{"$nulls":6},"10m",{"$nulls":17},"","","","","","","","",13,120,247]
[{"$nulls":5},"130m",{"$nulls":8},"20m",{"$nulls":3},4,{"$nulls":13},"","","","","","","","",14,130,266]
[null,null,"Conso totale aller / retour",null,null,"140m",{"$nulls":8},"30m",{"$nulls":17},"","","","","","","","",15,140,285]
[null,null,"dans une bouteille de",null,null,"150m",{"$nulls":8},"40m",null,2,{"$nulls":15},"","","","","","","","",16,150,304]
[{"$nulls":5},"160m",{"$nulls":8},"50m",{"$nulls":17},"","","","","","","","",17,160,323]
[null,null,{"v":3,"d":"3.0L "},"=",{"$f":"IF(O11=\"!\",\"\",(1/C25)*(AB18+AB19+AB15+AB16+AB17+AD15+AD16+AD17+AC15+AC16+AC17))","v":{"v":107.66666666666666,"d":"107.7 B "}},"170m",{"$nulls":8},"60m",1,{"$nulls":16},"","","","","","","","",18,170,342]
[{"$nulls":5},"180m",{"$nulls":8},"70m",{"$nulls":17},"","","","","","","","",19,180,361]
[null,null,{"$f":"IF(E25<0,\"ERREUR !\",\"\")","v":""},null,null,"190m",{"$nulls":8},"80m",{"$nulls":17},"","","","","","","","",20,190,380]
[{"$nulls":5},"200m",{"$nulls":8},"90m",null,null,3,{"$nulls":14},"","","","","","","","",21,200,399]
[null,null,"(Conso aller)    =",null,{"$f":"IF(O11=\"!\",\"\",(1/C25)*(AB18+AB15+AB16+AB17+AD15+AD16+AD17+AC15+AC16+AC17))","v":{"v":88.66666666666666,"d":"88.7 B "}},"210m",{"$nulls":26},"","","","","","","","",22,210,418]
[{"$nulls":5},"220m",null,".",{"$nulls":6},{"$f":"IF(C20=\"1 profondeur par descente !\",\"!\",IF(C20=\"1 profondeur par montée !\",\"!\",\"\"))","v":""},{"$nulls":17},"","","","","","","","",23,220,437]
[{"$nulls":5},"230m",{"$nulls":26},"","","","","","","","",24,230,456]
[null,null,"Prévoir toujours beaucoup plus !",null,null,"240m",{"$nulls":26},"","","","","","","","",25,240,475]
[null,null,"(mauvais équilibrages, fuites,",null,null,"250m",{"$nulls":26},"","","","","","","","",26,250,494]
[null,null,"vidages, rinçages…).Redondance !!!",null,null,"260m",{"$nulls":26},"","","","","","","","",27,260,513]
[{"$nulls":5},"270m",{"$nulls":26},"","","","","","","","",28,270,532]
[{"$nulls":5},"280m",{"$nulls":26},"","","","","","","","",29,280,551]
[{"$nulls":5},"290m",{"$nulls":26},"","","","","","","","",30,290,570]
[{"$nulls":5},"300m",{"$nulls":26},"","","","","","","","",31,300,589]
[{"$nulls":6},{"$f":"SUM(G8:G38)","v":1},2,3,0,0,0,0,0]
[]
[{"$nulls":32},{"$f":"SUM(AG8:AG38)","v":171},114,209,0,0,0,0,0]
[{"$nulls":32},{"$f":"AG41","v":171},0,{"$f":"IF(AI41=0,0,AI41-AH41)","v":95},0,{"$f":"IF(AK41=0,0,AK41-AJ41)","v":0},0,{"$f":"IF(AM41=0,0,AM41-AL41)","v":0},0]
[{"$nulls":32},{"$f":"IF(AH41=0,0,IF(AI41=0,AG41-AH41,))","v":0},{"$f":"IF(AI41=0,0,AG41-AH41)","v":57},0,{"$f":"IF(AJ41=0,0,AI41-AJ41)","v":0},0,{"$f":"IF(AL41=0,0,AK41-AL41)","v":0},0,{"$f":"IF(AN41=0,0,AM41-AN41)","v":0}]

{"sheet":"17","index":20,"n_rows":31,"n_cols":12,"rows_kept":31,"merged":[[7,1,9,2],[7,3,9,3],[7,5,9,6],[7,7,9,7],[7,9,9,10],[7,11,9,11]]}
[null,null,"Contrôle des cellules d'un recycleur CCR"]
[{"$nulls":4},"par rinçage diluant"]
["JP Couloumy","( lire )"]
[null,"( lire )"]
[null,null,"Pourcentage O2 du diluant",{"$nulls":4},{"v":10,"d":"10  %"}]
[]
[null,"            O2  =",null,{"$f":"H5","v":{"v":10,"d":"10%"}},null,"            O2  =",null,{"$f":"H5","v":{"v":10,"d":"10%"}},null,"            O2  =",null,{"$f":"H5","v":{"v":10,"d":"10%"}}]
[null,"Profondeur  rinçage",null,"PPO2 après rinçage",null,"Profondeur  rinçage",null,"PPO2 après rinçage",null,"Profondeur  rinçage",null,"PPO2 après rinçage"]
[]
[]
[null,0,"m",{"$f":"((B11+10)/10)*$H$5/100","v":{"v":0.1,"d":"0.10"}},null,100,"m",{"$f":"((F11+10)/10)*$H$5/100","v":{"v":1.1,"d":"1.10"}},null,200,"m",{"$f":"((J11+10)/10)*$H$5/100","v":{"v":2.1,"d":"2.10"}}]
[null,5,"m",{"$f":"((B12+10)/10)*$H$5/100","v":0.15},null,105,"m",{"$f":"((F12+10)/10)*$H$5/100","v":1.15},null,205,"m",{"$f":"((J12+10)/10)*$H$5/100","v":2.15}]
[null,10,"m",{"v":0.2,"d":"0.20"},null,110,"m",{"v":1.2,"d":"1.20"},null,210,"m",{"v":2.2,"d":"2.20"}]
[null,15,"m",0.25,null,115,"m",1.25,null,215,"m",2.25]
[null,20,"m",{"v":0.3,"d":"0.30"},null,120,"m",{"v":1.3,"d":"1.30"},null,220,"m",{"v":2.3,"d":"2.30"}]
[null,25,"m",0.35,null,125,"m",1.35,null,225,"m",2.35]
[null,30,"m",{"v":0.4,"d":"0.40"},null,130,"m",{"v":1.4,"d":"1.40"},null,230,"m",{"v":2.4,"d":"2.40"}]
[null,35,"m",0.45,null,135,"m",1.45,null,235,"m",2.45]
[null,40,"m",{"v":0.5,"d":"0.50"},null,140,"m",{"v":1.5,"d":"1.50"},null,240,"m",{"v":2.5,"d":"2.50"}]
[null,45,"m",0.55,null,145,"m",1.55,null,245,"m",2.55]
[null,50,"m",{"$f":"((B21+10)/10)*$H$5/100","v":{"v":0.6,"d":"0.60"}},null,150,"m",{"v":1.6,"d":"1.60"},null,250,"m",{"v":2.6,"d":"2.60"}]
[null,55,"m",{"$f":"((B22+10)/10)*$H$5/100","v":0.65},null,155,"m",1.65,null,255,"m",2.65]
[null,60,"m",{"v":0.7,"d":"0.70"},null,160,"m",{"v":1.7,"d":"1.70"},null,260,"m",{"v":2.7,"d":"2.70"}]
[null,65,"m",0.75,null,165,"m",1.75,null,265,"m",2.75]
[null,70,"m",{"v":0.8,"d":"0.80"},null,170,"m",{"v":1.8,"d":"1.80"},null,270,"m",{"v":2.8,"d":"2.80"}]
[null,75,"m",0.85,null,175,"m",{"$f":"((F26+10)/10)*$H$5/100","v":1.85},null,275,"m",2.85]
[null,80,"m",{"v":0.9,"d":"0.90"},null,180,"m",{"$f":"((F27+10)/10)*$H$5/100","v":{"v":1.9,"d":"1.90"}},null,280,"m",{"v":2.9,"d":"2.90"}]
[null,85,"m",0.95,null,185,"m",{"$f":"((F28+10)/10)*$H$5/100","v":1.95},null,285,"m",2.95]
[null,90,"m",{"v":1,"d":"1.00"},null,190,"m",{"$f":"((F29+10)/10)*$H$5/100","v":{"v":2,"d":"2.00"}},null,290,"m",{"v":3,"d":"3.00"}]
[null,95,"m",1.05,null,195,"m",{"$f":"((F30+10)/10)*$H$5/100","v":2.05},null,295,"m",3.05]
[{"$nulls":9},300,"m",{"v":3.1,"d":"3.10"}]

{"sheet":"18","index":21,"n_rows":20,"n_cols":36,"rows_kept":20,"merged":[[3,0,3,1],[5,3,6,3],[7,2,8,2],[7,6,8,6],[7,10,8,10],[7,14,8,14],[7,18,8,18],[7,22,8,22],[7,26,8,26],[7,30,8,30],[7,34,8,34],[15,3,16,3],[15,7,16,7],[15,11,16,11],[15,15,16,15],[15,19,16,19],[15,23,16,23],[15,27,16,27],[15,31,16,31],[15,35,16,35],[19,3,20,3],[19,7,20,7],[19,11,20,11],[19,15,20,15],[19,19,20,19],[19,23,20,23],[19,27,20,27],[19,31,20,31],[19,35,20,35]]}
[]
[{"$nulls":3},"REMPLISSAGE  DEPUIS  BOUTEILLE  TAMPON"]
[]
["JP Couloumy",null,null,"1ère bouteille",{"$nulls":3},"2ème bouteille",{"$nulls":3},"3ème bouteille",{"$nulls":3},"4ème bouteille",{"$nulls":3},"5ème bouteille",{"$nulls":3},"6ème bouteille",{"$nulls":3},"7ème bouteille",{"$nulls":3},"8ème bouteille",{"$nulls":3},"9ème bouteille"]
[]
[null,"Bouteille",null,"vers"]
[null,"Tampon",{"$nulls":3},"Tampon",null,"vers",null,"Tampon",null,"vers",null,"Tampon",null,"vers",null,"Tampon",null,"vers",null,"Tampon",null,"vers",null,"Tampon",null,"vers",null,"Tampon",null,"vers",null,"Tampon",null,"vers"]
[null,{"v":18,"d":"18 L"},null,{"v":3,"d":"3 L"},null,{"$f":"$B$8","v":{"v":18,"d":"18L"}},null,{"v":3,"d":"3 L"},null,{"$f":"$B$8","v":{"v":18,"d":"18L"}},null,{"v":3,"d":"3 L"},null,{"$f":"$B$8","v":{"v":18,"d":"18L"}},null,{"v":3,"d":"3 L"},null,{"$f":"$B$8","v":{"v":18,"d":"18L"}},null,{"v":3,"d":"3 L"},null,{"$f":"$B$8","v":{"v":18,"d":"18L"}},null,{"v":3,"d":"3 L"},null,{"$f":"$B$8","v":{"v":18,"d":"18L"}},null,{"v":0,"d":"0 L"},null,{"$f":"$B$8","v":{"v":18,"d":"18L"}},null,{"v":0,"d":"0 L"},null,{"$f":"$B$8","v":{"v":18,"d":"18L"}},null,{"v":0,"d":"0 L"}]
[null,{"v":180,"d":"180 B"},null,{"v":50,"d":"50 B"},null,{"$f":"B16","v":{"v":163,"d":"163 B"}},null,{"v":80,"d":"80 B"},null,{"$f":"F16","v":{"v":151,"d":"151 B"}},null,{"v":50,"d":"50 B"},null,{"$f":"J16","v":{"v":136,"d":"136 B"}},null,{"v":50,"d":"50 B"},null,{"$f":"N16","v":{"v":124,"d":"124 B"}},null,{"v":50,"d":"50 B"},null,{"$f":"R16","v":{"v":114,"d":"114 B"}},null,{"v":30,"d":"30 B"},null,{"$f":"V16","v":{"v":102,"d":"102 B"}},null,{"v":0,"d":"0 B"},null,{"$f":"Z16","v":{"v":102,"d":"102 B"}},null,{"v":0,"d":"0 B"},null,{"$f":"AD16","v":{"v":102,"d":"102 B"}},null,{"v":0,"d":"0 B"}]
[]
[]
[]
[]
[{"$nulls":3},"Pression",{"$nulls":3},"Pression",{"$nulls":3},"Pression",{"$nulls":3},"Pression",{"$nulls":3},"Pression",{"$nulls":3},"Pression",{"$nulls":3},"Pression",{"$nulls":3},"Pression",{"$nulls":3},"Pression"]
[null,"Restera",null,"désirée",null,"Restera",null,"désirée",null,"Restera",null,"désirée",null,"Restera",null,"désirée",null,"Restera",null,"désirée",null,"Restera",null,"désirée",null,"Restera",null,"désirée",null,"Restera",null,"désirée",null,"Restera",null,"désirée"]
[null,{"$f":"ROUNDDOWN(((B9*B8)-(D18-D9)*D8)/B8,0)","v":{"v":163,"d":"163 B"}},null,{"$f":"IF(D18>B16,\"Erreur !\",IF(D9>D18,\"Erreur !\",\"\"))","v":""},null,{"$f":"ROUNDDOWN(((F9*F8)-(H18-H9)*H8)/$B$8,0)","v":{"v":151,"d":"151 B"}},null,{"$f":"IF(H18>F16,\"Erreur !\",IF(H9>H18,\"Erreur !\",\"\"))","v":""},null,{"$f":"ROUNDDOWN(((J9*J8)-(L18-L9)*L8)/$B$8,0)","v":{"v":136,"d":"136 B"}},null,{"$f":"IF(L18>J16,\"Erreur !\",IF(L9>L18,\"Erreur !\",\"\"))","v":""},null,{"$f":"ROUNDDOWN(((N9*N8)-(P18-P9)*P8)/$B$8,0)","v":{"v":124,"d":"124 B"}},null,{"$f":"IF(P18>N16,\"Erreur !\",IF(P9>P18,\"Erreur !\",\"\"))","v":""},null,{"$f":"ROUNDDOWN(((R9*R8)-(T18-T9)*T8)/$B$8,0)","v":{"v":114,"d":"114 B"}},null,{"$f":"IF(T18>R16,\"Erreur !\",IF(T9>T18,\"Erreur !\",\"\"))","v":""},null,{"$f":"ROUNDDOWN(((V9*V8)-(X18-X9)*X8)/$B$8,0)","v":{"v":102,"d":"102 B"}},null,{"$f":"IF(X18>V16,\"Erreur !\",IF(X9>X18,\"Erreur !\",\"\"))","v":""},null,{"$f":"ROUNDDOWN(((Z9*Z8)-(AB18-AB9)*AB8)/$B$8,0)","v":{"v":102,"d":"102 B"}},null,{"$f":"IF(AB18>Z16,\"Erreur !\",IF(AB9>AB18,\"Erreur !\",\"\"))","v":""},null,{"$f":"ROUNDDOWN(((AD9*AD8)-(AF18-AF9)*AF8)/$B$8,0)","v":{"v":102,"d":"102 B"}},null,{"$f":"IF(AF18>AD16,\"Erreur !\",IF(AF9>AF18,\"Erreur !\",\"\"))","v":""},null,{"$f":"ROUNDDOWN(((AH9*AH8)-(AJ18-AJ9)*AJ8)/$B$8,0)","v":{"v":102,"d":"102 B"}},null,{"$f":"IF(AJ18>AH16,\"Erreur !\",IF(AJ9>AJ18,\"Erreur !\",\"\"))","v":""}]
[]
[{"$nulls":3},{"v":150,"d":"150 B"},{"$nulls":3},{"v":150,"d":"150 B"},{"$nulls":3},{"v":135,"d":"135 B"},{"$nulls":3},{"v":120,"d":"120 B"},{"$nulls":3},{"v":110,"d":"110 B"},{"$nulls":3},{"v":100,"d":"100 B"},{"$nulls":3},{"v":0,"d":"0 B"},{"$nulls":3},{"v":0,"d":"0 B"},{"$nulls":3},{"v":0,"d":"0 B"}]
[]
[{"$nulls":3},{"$f":"IF(D18>B16,\"?\",\"\")","v":""},{"$nulls":3},{"$f":"IF(H18>F16,\"?\",\"\")","v":""},{"$nulls":3},{"$f":"IF(L18>J16,\"?\",\"\")","v":""},{"$nulls":3},{"$f":"IF(P18>N16,\"?\",\"\")","v":""},{"$nulls":3},{"$f":"IF(T18>R16,\"?\",\"\")","v":""},{"$nulls":3},{"$f":"IF(X18>V16,\"?\",\"\")","v":""},{"$nulls":3},{"$f":"IF(AB18>Z16,\"?\",\"\")","v":""},{"$nulls":3},{"$f":"IF(AF18>AD16,\"?\",\"\")","v":""},{"$nulls":3},{"$f":"IF(AJ18>AH16,\"?\",\"\")","v":""}]

{"sheet":"19","index":22,"n_rows":40,"n_cols":18,"rows_kept":40,"merged":[[1,5,2,11],[3,5,4,11],[5,5,5,11],[7,3,7,4],[7,5,8,6],[8,12,8,13],[8,14,8,15],[9,3,9,4],[9,5,9,6],[9,10,9,11],[10,8,10,9],[10,12,10,13],[10,14,10,16],[11,10,11,11],[14,2,14,5],[14,8,14,11],[15,2,15,3],[15,4,15,5],[15,8,15,9],[15,10,15,11],[16,2,16,3],[16,4,16,5],[16,8,16,9],[16,10,16,11],[19,1,19,2],[19,4,19,5],[19,7,19,8],[19,10,19,11],[19,13,19,14],[19,16,19,17],[23,1,23,2],[23,4,23,5],[23,7,23,8],[23,10,23,11],[23,13,23,14],[23,16,23,17],[27,1,27,2],[27,4,27,5],[27,7,27,8],[27,10,27,11],[27,13,27,14],[27,16,27,17],[31,1,32,4],[31,5,32,5],[32,7,32,10],[32,13,32,14],[32,16,32,17],[33,1,34,1],[33,4,34,4],[33,7,33,10],[34,7,34,8],[34,9,34,10],[35,9,35,10],[35,13,35,14],[35,16,35,17],[36,7,36,10],[38,13,38,14],[38,16,38,17]]}
[]
[{"$nulls":5},"PANNE  DE  SCOOTER !"]
[]
[{"$nulls":5},"RETOUR  A  LA  PALME"]
[]
[{"$nulls":5},"(consommations)"]
[]
[{"$nulls":3},{"$f":"C22","v":{"v":0,"d":"0 m"}},null,{"$f":"F22","v":{"v":0,"d":"0 m"}}]
[null,null,"Entrée",{"$nulls":5},{"$f":"I22","v":{"v":0,"d":"0 m"}},{"$nulls":3},{"$f":"O22","v":{"v":0,"d":"0 m"}},null,{"$f":"R22","v":{"v":0,"d":"0 m"}}]
[{"$nulls":3},"1er tronçon",null,"2ème tronçon",{"$nulls":4},{"$f":"L22","v":{"v":0,"d":"0 m"}},{"$nulls":5},"fond"]
[{"$nulls":8},"3ème tronçon",{"$nulls":3},"5ème tronçon",null,"6ème tronçon"]
[null,"(lire)",{"$nulls":8},"4ème tronçon"]
[]
[]
[null,null,"Aller en SCOOTER",{"$nulls":5},"Retour à la PALME"]
[null,null,"Conso surface",null,"Vitesse",{"$nulls":3},"Conso surface",null,"Vitesse"]
[null,null,{"v":17,"d":"17 Lmn"},null,{"v":30,"d":"30 m/mn"},{"$nulls":3},{"v":25,"d":"25 Lmn"},null,{"v":18,"d":"18 m/mn"}]
[]
[]
[null,"1er tronçon",null,null,"2ème tronçon",null,null,"3ème tronçon",null,null,"4ème tronçon",null,null,"5ème tronçon",null,null,"6ème tronçon"]
[null,"profondeur","distance",null,"profondeur","distance",null,"profondeur","distance",null,"profondeur","distance",null,"profondeur","distance",null,"profondeur","distance"]
[null,{"v":0,"d":"0 m"},{"v":0,"d":"0 m"},null,{"v":0,"d":"0 m"},{"v":0,"d":"0 m"},null,{"v":0,"d":"0 m"},{"v":0,"d":"0 m"},null,{"v":0,"d":"0 m"},{"v":0,"d":"0 m"},null,{"v":0,"d":"0 m"},{"v":0,"d":"0 m"},null,{"v":0,"d":"0 m"},{"v":0,"d":"0 m"}]
[]
[null,"SCOOTER",null,null,"SCOOTER",null,null,"SCOOTER",null,null,"SCOOTER",null,null,"SCOOTER",null,null,"SCOOTER"]
[null,"temps","conso",null,"temps","conso",null,"temps","conso",null,"temps","conso",null,"temps","conso",null,"temps","conso"]
[null,{"$f":"IF(C22=0,0,1/$E$17*C22)","v":{"v":0,"d":"0 mn"}},{"$f":"$C$17*(B22+10)/10*B26","v":{"v":0,"d":"0 L"}},null,{"$f":"IF(F22=0,0,1/$E$17*F22)","v":{"v":0,"d":"0 mn"}},{"$f":"$C$17*(E22+10)/10*E26","v":{"v":0,"d":"0 L"}},null,{"$f":"IF(I22=0,0,1/$E$17*I22)","v":{"v":0,"d":"0 mn"}},{"$f":"$C$17*(H22+10)/10*H26","v":{"v":0,"d":"0 L"}},null,{"$f":"IF(L22=0,0,1/$E$17*L22)","v":{"v":0,"d":"0 mn"}},{"$f":"$C$17*(K22+10)/10*K26","v":{"v":0,"d":"0 L"}},null,{"$f":"IF(O22=0,0,1/$E$17*O22)","v":{"v":0,"d":"0 mn"}},{"$f":"$C$17*(N22+10)/10*N26","v":{"v":0,"d":"0 L"}},null,{"$f":"IF(R22=0,0,1/$E$17*R22)","v":{"v":0,"d":"0 mn"}},{"$f":"$C$17*(Q22+10)/10*Q26","v":{"v":0,"d":"0 L"}}]
[]
[null,"PALME",null,null,"PALME",null,null,"PALME",null,null,"PALME",null,null,"PALME",null,null,"PALME"]
[null,"temps","conso",null,"temps","conso",null,"temps","conso",null,"temps","conso",null,"temps","conso",null,"temps","conso"]
[null,{"$f":"IF(C22=0,0,1/$K$17*C22)","v":{"v":0,"d":"0 mn"}},{"$f":"$I$17*(B22+10)/10*B30","v":{"v":0,"d":"0 L"}},null,{"$f":"IF(F22=0,0,1/$K$17*F22)","v":{"v":0,"d":"0 mn"}},{"$f":"$I$17*(E22+10)/10*E30","v":{"v":0,"d":"0 L"}},null,{"$f":"IF(I22=0,0,1/$K$17*I22)","v":{"v":0,"d":"0 mn"}},{"$f":"$I$17*(H22+10)/10*H30","v":{"v":0,"d":"0 L"}},null,{"$f":"IF(L22=0,0,1/$K$17*L22)","v":{"v":0,"d":"0 mn"}},{"$f":"$I$17*(K22+10)/10*K30","v":{"v":0,"d":"0 L"}},null,{"$f":"IF(O22=0,0,1/$K$17*O22)","v":{"v":0,"d":"0 mn"}},{"$f":"$I$17*(N22+10)/10*N30","v":{"v":0,"d":"0 L"}},null,{"$f":"IF(R22=0,0,1/$K$17*R22)","v":{"v":0,"d":"0 mn"}},{"$f":"$I$17*(Q22+10)/10*Q30","v":{"v":0,"d":"0 L"}}]
[]
[null,"Distance totale aller (ou retour)    =",{"$nulls":3},{"$f":"C22+F22+I22+L22+O22+R22","v":{"v":0,"d":"0 m"}}]
[{"$nulls":7},"Prévoir 1/4, voire 1/3 de gaz en plus",{"$nulls":5},"mémoire scooter (1 à 6)",null,"(lire)","mémoire palme (1 à 6)"]
[null,"Scooter",{"$f":"B26+E26+H26+K26+N26+Q26","v":{"v":0,"d":"0 mn"}},null,"Palme",{"$f":"B30+E30+H30+K30+N30+Q30","v":{"v":0,"d":"0 mn"}},null,"pour retard, surconsommation…",{"$nulls":5},"Temps","Conso",null,"Temps","Conso"]
[null,null,{"$f":"C26+F26+I26+L26+O26+R26","v":{"v":0,"d":"0 L"}},null,null,{"$f":"C30+F30+I30+L30+O30+R30","v":{"v":0,"d":"0 L"}},null,{"$f":"F35+(F35/4)","v":{"v":0,"d":"0 L"}},null,{"$f":"F35+(F35/3)","v":{"v":0,"d":"0 L"}},{"$nulls":3},0,0,null,0,0]
[{"$nulls":8}," (+1/4)"," (+1/3)",{"$nulls":3},"mémoire scooter (7 à 12)",null,null,"mémoire palme (7 à 12)"]
[null,"Différence  scooter / palme :",null,null,{"$f":"F34-C34","v":{"v":0,"d":"0 mn"}},{"$f":"F35-C35","v":{"v":0,"d":"0 L"}},null,"Prévoir aussi panne détendeur !",{"$nulls":5},"Temps","Conso",null,"Temps","Conso"]
[{"$nulls":13},0,0,null,0,0]
[{"$nulls":13},"Total",null,null,"Total"]
[{"$nulls":13},{"$f":"N35+N38","v":{"v":0,"d":"0 mn"}},{"$f":"O35+O38","v":{"v":0,"d":"0 L"}},null,{"$f":"Q35+Q38","v":{"v":0,"d":"0 mn"}},{"$f":"R35+R38","v":{"v":0,"d":"0 L"}}]